{"text_format":"1","workbook":"xlsx","n_sheets":24,"sheets":["ReadMe","RES","A","B-1","B","C","C-Sum","E","F","G","H","J Summary","J Detail","J Detail pg 2 - COCA","J Detail pg 3 - Prof Svs","J-Adm","L","M","N","O","O Add'l","P","CountyList","Lists"],"not_rendered":{"charts":0,"images":1,"macros":1,"external_links":11,"defined_names":3043,"comments":12,"pivot_tables":0},"unopened":[],"bounds":{"document_bytes":16777216,"sheet_cells":100000,"rows_first":2000,"rows_last":500,"rows_between":2000,"halvings":0,"cell_chars":16384,"cell_head_chars":4096},"cells_cut":0,"cells_raw":0,"read":"whole","date_system":"1900"}

{"sheet":"ReadMe","index":0,"n_rows":32,"n_cols":4,"rows_kept":32,"cut":false,"hidden":false,"merged":[[0,0,0,4],[1,1,1,3],[2,1,2,3],[23,1,23,3],[24,2,24,3],[15,1,15,3],[17,1,17,3],[19,1,19,3],[21,1,21,3],[7,1,7,3],[9,1,9,3],[11,1,11,3],[13,1,13,3],[5,1,5,3],[3,1,3,3]]}
[]
[null,"DDA Residential Programs Cost Report General Guidelines"]
[]
[null,"1. For 2018, Schedule B-1 and Schedule E will continue to include a section to record the 1163 employee training hours not being settled from January 1, 2018 to December 31, 2018 so that the hours and related expense can be deducted from settlement. Intructions for tracking and reporting 1163 training was sent to providers earlier this year. The department has also decided to extend the Consideration of Overtime Credit for 2018, however the way the credit is calculated on Schedule J Summary is slightly different. A decription and sample of these changes were sent to providers in late October."]
[]
[null,"2. The completed cost report must be submitted in excel format using the 12/18 revised cost report template. The cost report (Schedules A, B-1, B, C, E, F, G, H, L, M, N, O & P), settlement (Schedules J Summary, J Detail, & J Detail pg 2 - COCA) are all on a single file. The completed report is to be emailed to both your resource manager and rate analyst (see below for rate analyst). The department no longer accepts Cost Report templates and survey templates from previous years. The current year cost report templates and related materials are available on the web. In addition, cost reports received in PDF or by mail cannot be accepted; only the signed Schedule A is to be scanned as PDF and attached to the email submitting the cost report. If scanning Schedule A is not possible, the signed form (Schedule A only) may be mailed or faxed to your regional resource manager. The resource manager will forward the signed Schedule A to the rates department if mailed or faxed."]
[]
[null,"3. Providers are to fill in cells that are formatted white. Cells that are formatted in yellow are locked and cannot be changed. Several places throughout the cost report, providers will select from a drop down list instead of typing in their information. Do not copy and paste while using this form."]
{"$rows_left_out":25}
{"sheet":"RES","index":1,"n_rows":242,"n_cols":11,"rows_kept":242,"cut":false,"hidden":true,"merged":[[71,2,71,3],[80,2,80,3],[80,4,80,10],[27,2,27,3],[47,2,47,3],[54,2,54,3],[67,2,67,3],[67,4,67,10],[54,4,54,10],[47,4,47,10],[27,4,27,10],[193,4,193,10],[193,2,193,3],[198,2,198,3],[198,4,198,10],[173,4,173,10],[173,2,173,3],[10,0,15,0],[153,2,153,3],[153,4,153,10],[160,4,160,10],[160,2,160,3],[107,2,107,3],[107,4,107,10],[120,2,120,3],[120,4,120,10],[133,2,133,3],[100,2,100,3],[100,4,100,10],[133,4,133,10],[124,4,124,10],[124,2,124,3],[18,2,18,3],[7,0,9,0],[0,0,6,0],[7,2,9,2],[7,3,9,3],[0,6,6,10]]}
[" ","FILE NAME:",{"$f":"MID(CELL(\"filename\",A1),FIND(\"[\",CELL(\"filename\",A1))+1,FIND(\".\",CELL(\"filename\",A1),FIND(\"[\",CELL(\"filename\",A1))+1)-FIND(\"[\",CELL(\"filename\",A1))-1)","v":"2018 Cost Report - Template"}]
[null,"PROVIDER NAME:",{"$f":"_M000001","v":0}]
[null,"REGION:",{"$f":"_M000009","v":""}]
[null,"CITY, ZIP:",{"$f":"_M000005","v":0}]
[null,"MEDICAL SVS:",{"$f":"_M000025","v":0}]
[null,"BUSINESS TYPE: ",{"$f":"B!D13","v":0}]
[null,"ACCTNG BASIS:",{"$f":"B!D17","v":0}]
[null,"PROVIDER NAME","TOTAL SETTLED PROGRAMS","TOTAL ALL PROGRAMS",{"$f":"IF(_M001567=\"\",\"\",_M001567)","v":""},{"$f":"IF(_M001568=\"\",\"\",_M001568)","v":""},{"$f":"IF(_M001569=\"\",\"\",_M001569)","v":""},{"$f":"IF(_M001570=\"\",\"\",_M001570)","v":""},{"$f":"IF(_M001571=\"\",\"\",_M001571)","v":"SSP"},{"$f":"IF(_M001572=\"\",\"\",_M001572)","v":"OTHER"},{"$f":"IF(_M001573=\"\",\"\",_M001573)","v":"OTHER"}]
{"$rows_left_out":235}
{"sheet":"A","index":2,"n_rows":36,"n_cols":5,"rows_kept":36,"cut":false,"hidden":false,"merged":[[0,0,0,5],[18,3,18,4],[26,2,26,3],[23,1,23,3],[29,2,29,3],[2,1,2,4],[28,1,28,3],[6,1,6,2],[25,1,25,3],[4,1,5,2],[8,3,8,4],[10,3,10,4],[12,1,12,4],[14,3,14,4],[16,2,16,4],[20,3,20,4]]}
["SCHEDULE  A"]
[]
[]
[null,"PART A - PROVIDER IDENTIFYING INFORMATION"]
[null,"1. PROVIDER AGENCY NAME",null,"2. PROVIDER ONE ID (a) SSPS ID (b)"]
[null,null,null,{"$f":"IF(_M000001=\"\",\"\",VLOOKUP(_M000001,Lists!$A$2:$C$138,2,FALSE))","v":""},"a"]
[null,null,null,{"$f":"IF(_M000001=\"\",\"\",IF(VLOOKUP(_M000001,Lists!$A$2:$C$138,3,FALSE)=\"\",\"\",VLOOKUP(_M000001,Lists!$A$2:$C$138,3,FALSE)))","v":""},"b"]
[null,"3. PROVIDER MAILING ADDRESS","4. CITY, ZIP ","5. PROVIDER PHONE NUMBER"]
{"$rows_left_out":29}
{"sheet":"B-1","index":3,"n_rows":26,"n_cols":18,"rows_kept":26,"cut":false,"hidden":false,"merged":[[18,17,21,17],[15,1,15,2],[16,1,16,2],[18,1,21,2],[18,15,21,15],[18,16,21,16],[18,9,21,9],[18,8,21,8],[22,13,24,13],[22,10,24,10],[22,11,24,11],[18,14,21,14],[22,12,24,12],[22,14,24,14],[22,16,24,16],[22,17,24,17],[18,3,21,3],[18,4,21,4],[18,5,21,5],[18,6,21,6],[18,7,21,7],[18,10,21,10],[18,11,21,11],[18,12,21,12],[18,13,21,13],[22,3,24,3],[22,6,24,6],[22,7,24,7],[22,4,24,5],[22,15,24,15],[0,0,0,17],[2,14,2,17],[4,7,4,11],[10,1,10,2],[8,1,8,2],[9,1,9,2],[22,8,24,8],[22,9,24,9],[25,4,25,5],[11,1,11,2],[12,1,12,2],[13,1,13,2],[14,1,14,2],[17,1,17,2]]}
["SCHEDULE B-1"]
[null,null,null,null,null,null,null,null,"CONTRACT-RELATED HOURS AND WAGES ONLY"]
[null,null,null,null,null,null,null,null,null,null,null,null,null,null,{"$f":"_M000001","v":0}]
[null,null,null,null,null,null,null,null,null,null,null,null,null,null,"PROVIDER NAME"]
[]
[]
[]
[null,"STAFF SUMMARY - TO BE SUMMITTED WITH COST REPORT"]
{"$rows_left_out":19}
{"sheet":"B","index":4,"n_rows":41,"n_cols":14,"rows_kept":41,"cut":false,"hidden":false,"merged":[[33,2,33,6],[37,2,37,6],[33,10,33,11],[38,1,38,13],[0,0,0,14],[2,10,2,13],[7,3,7,13],[29,3,29,4],[20,3,20,11],[8,4,9,13],[22,3,22,11],[24,3,24,10],[29,10,29,11],[27,10,27,11],[25,1,25,13],[28,10,28,11],[24,11,24,12],[26,1,26,13],[27,1,27,4],[37,10,37,11],[36,3,36,4],[34,10,34,11],[35,10,35,11],[30,3,30,4],[32,10,32,11],[36,10,36,11],[32,3,32,4],[34,3,34,4],[35,3,35,4],[31,10,31,11],[31,3,31,4],[30,10,30,11]]}
["SCHEDULE B"]
[]
[null,null,null,null,null,null,null,null,null,null,{"$f":"_M000001","v":0}]
[null,null,null,null,null,null,null,null,null,null,"PROVIDER NAME"]
[]
[]
[]
[null,1,null,"ARE MEDICAL SERVICES PURCHASED OR PROVIDED FOR DEVELOPMENTAL DISABILITIES CONTRACTS?"]
{"$rows_left_out":34}
{"sheet":"C","index":5,"n_rows":112,"n_cols":12,"rows_kept":112,"cut":false,"hidden":false,"merged":[[0,0,0,11],[108,2,108,3],[66,2,66,4],[78,2,78,4],[12,1,19,1],[20,1,27,1],[47,1,64,1],[105,1,106,1],[90,1,100,1],[103,1,104,1],[67,1,71,1],[29,1,46,1],[72,1,76,1],[79,1,89,1],[11,2,11,3],[102,2,102,4],[15,2,15,3],[16,2,16,3],[2,9,2,11],[10,2,10,3],[9,2,9,3],[7,2,8,3],[6,1,6,3],[27,2,27,3],[11,5,11,11],[28,5,28,11],[22,2,22,3],[23,2,23,3],[24,2,24,3],[25,2,25,3],[26,2,26,3],[17,2,17,3],[18,2,18,3],[19,2,19,3],[20,2,20,3],[21,2,21,3],[12,2,12,3],[13,2,13,3],[14,2,14,3]]}
["SCHEDULE C"]
[]
[null,null,null,null,null,null,null,null,null,{"$f":"_M000001","v":0}]
[null,null,null,null,null,null,null,null,null,"PROVIDER NAME"]
[]
[]
[null,null,null,null,null,"A","B","C","D","E","F","G"]
[null,null,"ADMINISTRATIVE & OPERATIONS COSTS",null,"Program",{"$f":"_M000041","v":0},{"$f":"_M000049","v":0},{"$f":"_M000057","v":0},{"$f":"_M000065","v":0},"SSP","OTHER","OTHER"]
{"$rows_left_out":105}
{"sheet":"C-Sum","index":6,"n_rows":68,"n_cols":12,"rows_kept":68,"cut":false,"hidden":true,"merged":[[0,0,0,11],[11,2,11,4],[60,2,60,4],[2,9,2,11],[7,1,8,3],[2,5,2,8],[3,5,3,8],[4,5,4,8],[10,2,10,3],[9,2,9,3],[12,1,19,1],[64,2,64,3],[40,2,40,4],[47,2,47,4],[12,2,19,2],[21,1,38,1],[61,1,62,1],[48,1,58,1],[41,1,45,1]]}
["SCHEDULE C SUM"]
[]
[null,null,null,null,null,null,null,null,null,{"$f":"_M000001","v":0}]
[null,null,null,null,null,null,null,null,null,null,"PROVIDER NAME"]
[]
[]
[]
[null,"ADMIN. & OPERATIONS COSTS",null,null,"Program",{"$f":"B!$G30","v":0},{"$f":"B!$G31","v":0},{"$f":"B!$G32","v":0},{"$f":"B!$G33","v":0},{"$f":"B!$G35","v":"SSP"},{"$f":"B!$G36","v":"OTHER"},{"$f":"B!$G37","v":"OTHER"}]
{"$rows_left_out":61}
{"sheet":"E","index":7,"n_rows":49,"n_cols":11,"rows_kept":49,"cut":false,"hidden":false,"merged":[[0,0,0,10],[10,1,10,2],[6,4,6,10],[8,4,8,10],[2,8,2,10],[5,0,7,3],[8,1,9,2],[47,1,47,2],[18,1,18,2],[11,1,11,2],[21,1,21,2],[24,1,24,2],[25,1,25,2],[32,1,32,2],[45,1,45,2],[46,1,46,2],[37,1,37,2],[42,1,42,2],[43,1,43,2],[44,1,44,2],[20,1,20,2]]}
["SCHEDULE E"]
[]
[null,null,null,null,null,null,null,null,{"$f":"_M000001","v":0}]
[null,null,null,null,null,null,null,null,"PROVIDER NAME"]
[]
[null,null,null,null,"A","B","C","D","E","F","G"]
[null,null,null,null,"PROGRAMS"]
[null,null,null,null,{"$f":"B!$G30","v":0},{"$f":"B!$G31","v":0},{"$f":"B!$G32","v":0},{"$f":"B!$G33","v":0},{"$f":"B!$G35","v":"SSP"},{"$f":"B!$G36","v":"OTHER"},{"$f":"B!$G37","v":"OTHER"}]
{"$rows_left_out":42}
{"sheet":"F","index":8,"n_rows":41,"n_cols":11,"rows_kept":41,"cut":false,"hidden":false,"merged":[[27,1,39,10],[0,0,0,10],[2,8,2,10],[9,2,9,10],[16,2,16,10],[21,2,21,10],[7,8,8,8],[7,9,8,9]]}
["SCHEDULE F"]
[]
[null,null,null,null,null,null,null,null,{"$f":"_M000001","v":0}]
[null,null,null,null,null,null,null,null,"PROVIDER NAME"]
[null,null,null,null,null,null,null," "," "," "]
[]
[null,null,"A","B","C","D","E","F ","G","H","I"]
[null,null,"LAND","LAND","BUILDINGS","BUILDING","LEASEHOLD ","FURNITURE AND",null,null,"VEHICLES"]
{"$rows_left_out":34}
{"sheet":"G","index":9,"n_rows":50,"n_cols":11,"rows_kept":50,"cut":false,"hidden":false,"merged":[[0,0,0,10],[43,1,48,10],[8,3,10,3],[8,2,10,2],[8,1,10,1],[9,7,10,7],[2,8,2,10],[9,8,9,9],[8,5,10,5],[8,4,10,4],[8,10,10,10],[11,1,11,10],[21,1,21,10],[32,1,32,10]]}
["SCHEDULE G"]
[]
[null,null,null,null,null,null,null,null,{"$f":"_M000001","v":0}]
[null,null,null,null,null,null,null,null,"PROVIDER NAME"]
[]
[]
[]
[null,"A","B","C","D","E","F","G","H","I","J"]
{"$rows_left_out":43}
{"sheet":"H","index":10,"n_rows":32,"n_cols":11,"rows_kept":32,"cut":false,"hidden":false,"merged":[[0,0,0,11],[8,0,8,2],[2,8,2,10],[1,1,1,2],[3,1,3,2],[6,1,6,2]]}
["SCHEDULE H"]
[]
[null,null,null,null,null,null,null,null,{"$f":"_M000001","v":0}]
[null,null,null,null,null,null,null,null,"PROVIDER NAME"]
[]
[null,null,null,null,"A","B","C","D","E","F","G"]
[null,null,null,null,null,null,null,"              PROGRAMS"]
[null,null,null,null,{"$f":"_M000041","v":0},{"$f":"_M000049","v":0},{"$f":"_M000057","v":0},{"$f":"_M000065","v":0},{"$f":"_M000073","v":"SSP"},{"$f":"_M000081","v":"OTHER"},{"$f":"_M000089","v":"OTHER"}]
{"$rows_left_out":25}
{"sheet":"J Summary","index":11,"n_rows":23,"n_cols":6,"rows_kept":23,"cut":false,"hidden":false,"merged":[[21,2,21,4],[15,2,15,4],[16,2,16,4],[17,2,17,4],[18,2,18,3],[19,2,19,4],[20,1,20,5],[14,1,14,5],[7,1,7,3],[8,2,8,3],[9,2,9,3],[10,2,10,3],[11,2,11,3],[12,2,12,3],[13,2,13,3],[6,1,6,5],[0,1,0,5],[1,2,1,3],[2,4,2,5],[3,4,3,5],[5,2,5,3]]}
[null,"J SUMMARY"]
[null,null," "]
[null,null,null,null,{"$f":"A!B7","v":0}]
[null,null,null,null,"PROVIDER NAME"]
[]
[null,"A","B",null,"C","D"]
[null,"SETTLEMENT A"]
[null,null,null,null,"ISS HOURS","DOLLAR CONVERSION"]
{"$rows_left_out":16}
{"sheet":"J Detail","index":12,"n_rows":48,"n_cols":9,"rows_kept":48,"cut":false,"hidden":false,"merged":[[0,0,0,5],[34,1,34,2],[35,1,35,2],[36,1,36,2],[37,1,37,2],[33,1,33,2],[21,1,21,2],[22,1,22,2],[23,1,23,2],[24,1,24,2],[25,1,25,2],[26,1,26,2],[27,1,27,2],[45,1,45,3],[1,1,1,5],[2,2,2,3],[3,2,3,3],[18,1,18,2],[17,1,17,2],[28,1,28,2],[29,1,29,2],[31,1,31,2],[32,1,32,2],[20,1,20,2],[38,1,38,2],[40,1,40,2]]}
["J DETAIL"]
[null,"Settlement Information Worksheet:  Service Hours and Reimbursement are for services provided during the calendar year.  The rate component information required (ISS @ benchmark, Other ISS and Admin) is available from your Schedule J Detail by Client or Exhibit C(s).  "]
[null,"Provider Name",{"$f":"A!B7","v":0},null,"Region",{"$f":"_M000009","v":""}]
[null,"Program Name",null,null,"Report Period",{"$f":"IF(_C000019=\"\",\"-\",MONTH(_C000019)&\"/\"&DAY(_C000019)&\"/\"&YEAR(_C000019)&\" - \"&MONTH(_C000020)&\"/\"&DAY(_C000020)&\"/\"&YEAR(_C000020))","v":"1/1/2018 - 12/31/2018"}]
[null,"A","B","C","D","E",null,null,"           "]
["Line #","Service Type - (SL,GH, or SL/GH) ","Date(s) of Service","Hours Reimbursed","Benchmark Rate","Regular ISS Reimbursement"]
[1,null,null,null,null,{"$f":"+D7*E7","v":0}]
[{"$f":"+A7+1","v":2},null,null,null,null,{"$f":"+D8*E8","v":0}]
{"$rows_left_out":41}
{"sheet":"J Detail pg 2 - COCA","index":13,"n_rows":43,"n_cols":9,"rows_kept":43,"cut":false,"hidden":false,"merged":[[0,0,0,5],[1,1,1,5],[2,2,2,3],[3,2,3,3]]}
["J DETAIL PG 2 - COCA"]
[null,"Settlement Information Worksheet:  Service Hours and Reimbursement are for services provided during the calendar year.  The rate component information required (ISS @ benchmark, Other ISS and Admin) is available from your Exhibit C(s).  "]
[null,"Provider Name",{"$f":"A!B7","v":0},null,"Region",{"$f":"_M001601","v":""}]
[null,"Program Name",{"$f":"_M001602","v":0},null,"Report Period",{"$f":"_C001603","v":"1/1/2018 - 12/31/2018"}]
[null,null,null,null,null,null,null,null,"           "]
["Line #","Individual COCA's","Date(s) of Service","Total ISS Hours Reimbursed","Benchmark Rate","Regular ISS Reimbursement"]
[1,"COCA",null,null,null,{"$f":"ROUND(+D7*E7,2)","v":0}]
[{"$f":"+A7+1","v":2},"COCA",null,null,null,0]
{"$rows_left_out":36}
{"sheet":"J Detail pg 3 - Prof Svs","index":14,"n_rows":43,"n_cols":9,"rows_kept":43,"cut":false,"hidden":true,"merged":[[37,1,37,2],[38,1,38,2],[39,1,39,2],[40,1,40,2],[31,1,31,2],[32,1,32,2],[33,1,33,2],[34,1,34,2],[35,1,35,2],[36,1,36,2],[30,1,30,2],[19,1,19,2],[20,1,20,2],[21,1,21,2],[22,1,22,2],[23,1,23,2],[24,1,24,2],[25,1,25,2],[26,1,26,2],[27,1,27,2],[28,1,28,2],[29,1,29,2],[18,1,18,2],[7,1,7,2],[8,1,8,2],[9,1,9,2],[10,1,10,2],[11,1,11,2],[12,1,12,2],[13,1,13,2],[14,1,14,2],[15,1,15,2],[16,1,16,2],[17,1,17,2],[6,1,6,2],[0,0,0,5],[1,1,1,5],[2,2,2,3],[3,2,3,3],[5,1,5,2]]}
["J DETAIL PG 3 - PROF SVS"]
[null,"Settlement Information Worksheet:  Service Hours and Reimbursement are for services provided during the calendar year.  The rate component information required (ISS @ benchmark, Other ISS and Admin) is available from your Exhibit C(s).  "]
[null,"Provider Name",{"$f":"#REF!","v":{"$error":"#REF!"}},null,"Region",{"$f":"_M001601","v":""}]
[null,"Program Name",{"$f":"_M001602","v":0},null,"Report Period",{"$f":"_C001603","v":"1/1/2018 - 12/31/2018"}]
[null,null,null,null,null,null,null,null,"           "]
["Line #","Non-Benchmark, Professional Services: Description (Nurse (RN, LPN), Therapist, etc.) - Continued from J Detail",null,"Total Hours Reimbursed","Prof. Srvcs. Rate","Other ISS Reimbursement"]
[1,null,null,null,null,{"$f":"ROUND(+D7*E7,2)","v":0}]
[{"$f":"+A7+1","v":2},null,null,null,null,0]
{"$rows_left_out":36}
{"sheet":"J-Adm","index":15,"n_rows":33,"n_cols":5,"rows_kept":33,"cut":false,"hidden":true,"merged":[[5,3,5,4],[2,3,2,4],[0,0,0,4],[28,1,28,3]]}
["J-ADM"]
[]
[null,null,null,{"$f":"#REF!","v":{"$error":"#REF!"}}]
[null,null,null,"PROVIDER NAME"]
[]
["Line","Administrative Rate Settlement Calculation for Hours Not Provided ",null,"Admin. Rate & Payment"]
[null,null,null,"Standard","Paid "]
[1,"Client Days subject to settlement",11272]
{"$rows_left_out":26}
{"sheet":"L","index":16,"n_rows":25,"n_cols":8,"rows_kept":25,"cut":false,"hidden":false,"merged":[[9,3,9,6],[10,3,10,6],[21,3,21,6],[22,3,22,6],[20,3,20,6],[0,0,0,8],[16,3,16,6],[17,3,17,6],[18,3,18,6],[19,3,19,6],[11,3,11,6],[12,3,12,6],[13,3,13,6],[14,3,14,6],[15,3,15,6],[2,6,2,7],[7,3,7,6],[8,3,8,6]]}
["SCHEDULE L"]
[]
[null,null,null,null,null,null,{"$f":"A!B7","v":0}]
[null,null,null,null,null,null,"PROVIDER NAME"]
[]
[]
[null,"FROM SCHEDULE","ACCT. #",null,null,"DESCRIPTION OF EXPENSES  IN \"OTHER\" CATEGORIES ",null,"AMOUNTS OVER $1,000"]
[]
{"$rows_left_out":18}
{"sheet":"M","index":17,"n_rows":18,"n_cols":10,"rows_kept":18,"cut":false,"hidden":false,"merged":[[0,1,0,9],[7,5,8,5],[7,8,8,8],[7,4,8,4],[2,7,2,9],[7,6,8,6],[7,7,8,7],[7,9,8,9],[5,1,5,9]]}
[null,"SCHEDULE M"]
[]
[null,null,null,null,null,null,null,{"$f":"A!B7","v":0}]
[null,null,null,null,null,null,null,"PROVIDER NAME"]
[]
[null,"Instructions:  Use this schedule to report ISS salary, wages and other compensation for owner(s) and/or individuals that have any other relationship, interest or involvement with the ownership of the agency other than an employer/employee arrangement.  Include only amounts that are included in schedule E, codes 5611, 5612 or 5614.  Do not include compensation for owners and/or individuals that are included in schedule C for administrators or other administrative staff. "]
[]
[null,null,null,"    SERVICES PERFORMED","Hours Worked During the Period","Cost Report Account Code","Salary Amount Included in Schedule E, lines 2 or 3","Fringe Benefits and PR Taxes Included in Schedule E, lines 2 or 3","Other Payments or Benefits Included in Schedule E, lines 2 or 3","Total ISS Payments or Benefits Included in Schedule E, lines 2 or 3"]
{"$rows_left_out":11}
{"sheet":"N","index":18,"n_rows":26,"n_cols":14,"rows_kept":26,"cut":false,"hidden":false,"merged":[[5,3,5,14],[7,2,7,14],[10,2,11,14],[12,2,13,14],[0,0,0,15],[2,13,2,14],[14,2,15,14],[16,2,17,14],[18,2,19,14],[20,2,21,14],[22,2,23,14]]}
["SCHEDULE N"]
[]
[null,null,null,null,null,null,null,null,null,null,null,null,null,{"$f":"_M000001","v":0}]
[null,null,null,null,null,null,null,null,null,null,null,null,null,"PROVIDER NAME"]
[]
[null,null,null,"SUPPORTED LIVING PROVIDERS ONLY:"]
[]
[null,null,"DOES THE AGENCY, ITS ADMINISTRATOR OR OWNER, HAVE OWNERSHIP INTEREST IN ANY OF THE HOMES RENTED BY CLIENTS SUPPORTED BY YOUR AGENCY?"]
{"$rows_left_out":19}
{"sheet":"O","index":19,"n_rows":81,"n_cols":11,"rows_kept":81,"cut":false,"hidden":false,"merged":[[19,4,19,8],[0,0,0,11],[2,8,2,10],[6,0,6,11],[10,1,10,9],[12,2,12,3],[12,4,12,7],[13,2,13,3],[13,4,13,7],[16,4,16,8],[17,4,17,8],[18,4,18,8],[5,0,5,11],[7,0,7,11],[39,2,39,8],[22,1,22,10],[23,2,23,8],[24,2,24,8],[25,2,25,8],[26,2,26,8],[33,2,33,8],[34,2,34,8],[35,2,35,8],[36,2,36,8],[37,2,37,8],[38,2,38,8],[59,1,59,10],[40,2,40,8],[41,2,41,8],[42,2,42,8],[43,2,43,8],[44,2,44,8],[45,2,45,8],[51,2,51,4],[52,2,52,4],[53,2,53,4],[54,2,54,4],[55,2,55,4],[70,1,70,10],[60,1,60,2],[60,4,60,5],[61,1,62,1],[61,2,62,2],[61,3,62,3],[61,4,61,5],[61,6,62,6],[61,7,62,7],[61,8,62,8],[61,9,62,9],[61,10,62,10],[77,1,77,10],[78,1,78,10],[75,5,75,6],[71,2,71,4],[71,5,71,6],[71,7,75,10],[72,2,72,4],[72,5,72,6],[73,2,73,4],[73,5,73,6],[74,2,74,4],[74,5,74,6],[75,2,75,4]]}
["SCHEDULE O"]
[]
[null,null,null,null,null,null,null,null,{"$f":"A!B7","v":0}]
[null,null,null,null,null,null,null,null,"PROVIDER NAME"]
[]
["IMPORTANT, PLEASE READ before completing schedule:"]
["COMPLETE A SEPARATE SCHEDULE FOR EACH LOCATION BY: PROGRAM TYPE AND COUNTY \nFOR ADDITIONAL COPIES OF SCHEDULE O CONTACT YOUR AGENCY'S RATE ANALYST \nReporting Period: January 1, 2018 to December 31, 2018 (One Calendar Year, 12 months, 2018)                                                                                                                                                                                                                                                                                                                                                                                                                                                                                                                                                                                                                                                     "]
["The schedule(s) will be reviewed by the rate analyst to ensure the agency is reporting contracts, programs, and locations separately. Any cost reports found to be incomplete will be returned to the agency for correction. "]
{"$rows_left_out":74}
{"sheet":"O Add'l","index":20,"n_rows":81,"n_cols":11,"rows_kept":81,"cut":false,"hidden":false,"merged":[[78,1,78,10],[73,5,73,6],[74,2,74,4],[74,5,74,6],[75,2,75,4],[75,5,75,6],[77,1,77,10],[70,1,70,10],[71,2,71,4],[71,5,71,6],[71,7,75,10],[72,2,72,4],[72,5,72,6],[73,2,73,4],[55,2,55,4],[59,1,59,10],[60,1,60,2],[60,4,60,5],[61,1,62,1],[61,2,62,2],[61,3,62,3],[61,4,61,5],[61,6,62,6],[61,7,62,7],[61,8,62,8],[61,9,62,9],[61,10,62,10],[54,2,54,4],[38,2,38,8],[39,2,39,8],[40,2,40,8],[41,2,41,8],[42,2,42,8],[43,2,43,8],[44,2,44,8],[45,2,45,8],[51,2,51,4],[52,2,52,4],[53,2,53,4],[37,2,37,8],[18,4,18,8],[19,4,19,8],[22,1,22,10],[23,2,23,8],[24,2,24,8],[25,2,25,8],[26,2,26,8],[33,2,33,8],[34,2,34,8],[35,2,35,8],[36,2,36,8],[17,4,17,8],[0,0,0,11],[2,8,2,10],[5,0,5,11],[6,0,6,11],[7,0,7,11],[10,1,10,9],[12,2,12,3],[12,4,12,7],[13,2,13,3],[13,4,13,7],[16,4,16,8]]}
["SCHEDULE O"]
[]
[null,null,null,null,null,null,null,null,{"$f":"A!B7","v":0}]
[null,null,null,null,null,null,null,null,"PROVIDER NAME"]
[]
["IMPORTANT, PLEASE READ before completing schedule:"]
["COMPLETE A SEPARATE SCHEDULE FOR EACH LOCATION BY: PROGRAM TYPE AND COUNTY \nFOR ADDITIONAL COPIES OF SCHEDULE O CONTACT YOUR AGENCY'S RATE ANALYST \nReporting Period: January 1, 2018 to December 31, 2018 (One Calendar Year, 12 months, 2018)                                                                                                                                                                                                                                                                                                                                                                                                                                                                                                                                                                                                                                                     "]
["The schedule(s) will be reviewed by the rate analyst to ensure the agency is reporting contracts, programs, and locations separately. Any cost reports found to be incomplete will be returned to the agency for correction. "]
{"$rows_left_out":74}
{"sheet":"P","index":21,"n_rows":46,"n_cols":11,"rows_kept":46,"cut":false,"hidden":false,"merged":[[0,0,0,11],[18,4,18,8],[19,4,19,8],[20,4,20,8],[21,4,21,8],[6,0,6,11],[3,8,3,10],[10,1,10,2],[9,9,9,10],[10,4,10,8],[11,4,11,8],[12,4,12,8],[5,0,5,11],[13,4,13,8],[14,4,14,8],[25,2,25,8],[27,2,27,8],[28,2,28,8],[34,2,34,8],[25,9,25,10],[27,9,27,10],[29,2,29,8],[28,9,28,10],[29,9,29,10],[31,9,31,10],[32,9,32,10],[33,9,33,10],[34,9,34,10],[26,2,26,8],[26,9,26,10],[43,2,43,8],[43,9,43,10],[44,2,44,8],[44,9,44,10],[30,2,30,8],[31,2,31,8],[32,2,32,8],[33,2,33,8],[30,9,30,10],[36,2,37,4],[39,2,40,4],[42,9,42,10],[42,2,42,8]]}
["SCHEDULE P"]
[]
[]
[null,null,null,null,null,null,null,null,{"$f":"A!B7","v":0}]
[null,null,null,null,null,null,null,null,"PROVIDER NAME"]
["INCLUDE ALL PROGRAMS FOR THE AGENCY ON THIS SCHEDULE"]
["Reporting Period: Dececmber 1, 2018  to  December 31, 2018 (One Month)"]
[]
{"$rows_left_out":39}
{"sheet":"CountyList","index":22,"n_rows":40,"n_cols":9,"rows_kept":40,"cut":false,"hidden":true,"merged":[]}
["County","MSA, Non MSA, King","Region","County Code",null,"County","MSA, Non MSA, King","Region","County Code"]
["Adams","NON-MSA","1N",1,null,"Adams","NON-MSA","1N",1]
["Asotin","MSA","1S",2,null,"Chelan","MSA","1N",4]
["Benton","MSA","1S",3,null,"Douglas","MSA","1N",9]
["Chelan","MSA","1N",4,null,"Ferry","NON-MSA","1N",10]
["Clallam","NON-MSA","3S",5,null,"Grant","NON-MSA","1N",13]
["Clark","MSA","3S",6,null,"Lincloln","NON-MSA","1N",22]
["Columbia","NON-MSA","1S",7,null,"Okanogan","NON-MSA","1N",24]
{"$rows_left_out":33}
{"sheet":"Lists","index":23,"n_rows":138,"n_cols":26,"rows_kept":138,"cut":false,"hidden":true,"merged":[]}
["Provider","Provider ID a.","Provider ID b.","FY18 Benchmark or Avg Benchmark","FY19 Benchmark or Avg Benchmark","Calander Year 2018 Average Benchmark","Urban Designation",null,"Urban Designation","FY2018 Jan - Jun Benchmark","FY2018 Jul - Dec Benchmark",null,"Sch B & J Detail",null,null,"Region","\"B\"",null,"Schedule B",null,null,null,null,null,null,"Schedule O"]
[null,null,null,null,null,null,null,null,"KING",18.53,19.53,null,null,null,null,null,null,null,1,2,3,"4a","4b","4c"]
["1N - Aacres WA",111414301,928190,{"$f":"VLOOKUP(G3,$I$2:$K$5,2)","v":17.93},{"$f":"VLOOKUP(G3,$I$2:$K$5,3)","v":18.93},{"$f":"SUM(D3+E3)/2","v":18.43},"MSA",null,"MSA",17.93,18.93,null,"SL",null,null,"1N","Cost Report",null,null,null,null,null,null,null,null,"Supported Living - Contracted"]
["1N - Aacres Spokane 2",111414310,null,17.93,18.93,{"$f":"SUM(D4+E4)/2","v":18.43},"MSA",null,"MSA/NON-MSA",{"$f":"+(17.93+17.62)/2","v":17.774999999999999},{"$f":"+(18.93+18.62)/2","v":18.774999999999999},null,"GH",null,null,"1S","Budget",null,"Yes","Individual","Cash","Yes","Yes","ISS Paid Hours Worked",null,"Group Homes"]
["1N - Aacres Spokane 3",111414309,null,17.93,18.93,{"$f":"SUM(D5+E5)/2","v":18.43},"MSA",null,"NON-MSA",17.62,18.62,null,"SL/GH",null,null,"2N",null,null,"No","Partnership","Accrual","No","No","Other Method",null,"Supported Living - SOLA"]
["1N - Adult Guidance & Empowerment Service",111684901,131592,17.93,18.93,18.43,"MSA",null,null,null,null,null,null,null,null,"2S",null,null,null,"Proprietary Corporation","Modified Cash",null,null,null,null,"Group Training Home"]
["1N - Ambitions - Wenatchee, Omak, Moses Lake",111901903,925218,17.774999999999999,18.774999999999999,18.274999999999999,"MSA/NON-MSA",null,null,null,null,null,null,null,null,"3N",null,null,null,"Non-Profit Corporation"]
["1N - Ambitions - Spokane",111901906,null,17.93,18.93,{"$f":"SUM(D8+E8)/2","v":18.43},"MSA",null,null,null,null,null,null,null,null,"3S",null,null,null,"Government Agency"]
{"$rows_left_out":130}