{"text_format":"1","workbook":"xlsx","n_sheets":13,"sheets":["Instructions","Lists","Administrator Regression Table","RES","ReadMe","A - General Info & Cert","B - ISS Payroll Expenses","C - Non-ISS Expenses","D - Revenue","E - Residential Staffing","E - Residential Staffing Add'l","F - Healthcare Expenses","G - ISS Settlement"],"not_rendered":{"charts":0,"images":1,"macros":1,"external_links":12,"defined_names":9412,"comments":5,"pivot_tables":0},"unopened":[],"bounds":{"document_bytes":16777216,"sheet_cells":100000,"rows_first":2000,"rows_last":500,"rows_between":2000,"halvings":0,"cell_chars":16384,"cell_head_chars":4096},"cells_cut":0,"cells_raw":0,"read":"whole","date_system":"1900"}

{"sheet":"Instructions","index":0,"n_rows":12,"n_cols":1,"rows_kept":12,"cut":false,"hidden":true,"merged":[]}
[]
[]
["Workbook must be manipulated to accommodate DDA changes"]
[]
["Unhide all tabs"]
["Unprotect all tabs"]
["Headings will need to be selected to make changes"]
[]
["Lists Tab"]
["Revise any list for drop down menus used throughout the cost report. This may affect formulas throughout the report. "]
{"$rows_left_out":3}
{"sheet":"Lists","index":1,"n_rows":145,"n_cols":19,"rows_kept":145,"cut":false,"hidden":true,"merged":[[0,15,0,18]]}
["Provider Name","Provider ID","Urban Designation",null,"Program Type","Service Code & RAC","Professional Services","Purchased Professional Services","COCA Service Code & RAC","Staff Add-On Service Code & RAC",null,"Monthly / Quarterly",null,"Region",null,"Schedule B"]
[null,null,null,null,null,null,null,null,null,null,null,null,null,null,null,1,"2a","2b","2c"]
["1N - Aacres WA",111414301,"MSA",null,"SL Supported Living","SL Supported Living","SL Behav Hab","SL Authorized ISS Purchased Professional Services","GH SA720-3603 COCA CORE","SA725-3701 GH STAFF ADD-ON FEDERAL RCL",null,"Monthly",null,"1N"]
["1N - Aacres Spokane 2",111414310,"MSA",null,"GH Group Home","GH Group Home","SL Hab DBT","GH Authorized ISS Purchased Professional Services","GH SA720-3701 COCA RCL","SA725-3905 GH STAFF ADD-ON FEDERAL State",null,"Quarterly",null,"1S",null,"Yes","Yes","Yes","Program Revenues"]
["1N - Aacres Spokane 3",111414309,"MSA",null,"GTH Group Training Home","GTH Group Training Home","SL Language Translator","GTH Authorized ISS Purchased Professional Services","GH SA726-3603 COCA CORE","SA719-3603 GH STAFF ADD-ON STATE CORE",null,null,null,"2N",null,"No","No","No","ISS/Direct Care Cost"]
["1N - Adult Guidance & Empowerment Service",111684901,"MSA",null,null,"SA716-3603 SL CORE","SL LPN M&C",null,"GH SA726-3701 COCA RCL","SA719-3701 GH STAFF ADD-ON STATE RCL",null,null,null,"2S",null,null,null,null,"Other Method - Please describe"]
["1N - Alpha Supported Living (Spokane)",111320906,"MSA",null,null,"SA716-3604 SL CP","SL RN M&C",null,"GH SA726-3905 COCA State","SA719-3905 GH STAFF ADD-ON STATE State",null,null,null,"3N"]
["1N - Ambitions - Spokane",111901906,"MSA",null,null,"SA716-3701 SL RCL","SL Sign Language Interp",null,"SL SA720-3603 COCA CORE","SA719-3603 SL STAFF ADD-ON STATE CORE",null,null,null,"3S"]
["1N - Ambitions - Wenatchee, Omak, Moses Lake",111901903,"MSA/NON-MSA",null,null,"SA716-3905 SL State","SL Other",null,"SL SA720-3604 COCA CP","SA719-3604 SL STAFF ADD-ON STATE CP"]
["1N - ARC of Spokane",111426502,"MSA",null,null,"SA722-3603 GH CORE","GH Behav Hab",null,"SL SA720-3701 COCA RCL","SA719-3701 SL STAFF ADD-ON STATE RCL"]
{"$rows_left_out":136}
{"sheet":"Administrator Regression Table","index":2,"n_rows":59,"n_cols":21,"rows_kept":59,"cut":false,"hidden":false,"merged":[]}
["NUMBER OF ISS FTE's","KING","MSA","MSA/\nNON-MSA","NON-MSA",null,null,"KING","MSA","MSA/\nNON-MSA","NON-MSA",null,"URBAN DESIGNATION & REPORTING PERIOD","FTE MTH/QRT WAGES FY2019",null,{"$f":"CONCATENATE(Q1,'B - ISS Payroll Expenses'!B10)","v":"MSAMonthly"},{"$f":"VLOOKUP(_M000001,Lists!A1:C145,3)","v":"MSA"},"KING","MSA","MSA/\nNON-MSA","NON-MSA"]
[1,{"$f":"2080*H4","v":81244.800000000003},{"$f":"2080*I4","v":78748.800000000003},{"$f":"2080*J4","v":78104},{"$f":"2080*K4","v":77459.199999999997},null,"FY2019 Benchmark",19.53,18.93,{"$f":"(18.93+18.62)/2","v":18.774999999999999},18.62,null,"KingMonthly",{"$f":"H7/12","v":3385.2000000000003}]
[2,{"$f":"$B$2-($B$2*(A3-1)*5%)","v":77182.559999999998},{"$f":"$C$2-($C$2*(A3-1)*5%)","v":74811.360000000001},{"$f":"$D$2-($D$2*(A3-1)*5%)","v":74198.8},{"$f":"$E$2-($E$2*(A3-1)*5%)","v":73586.239999999991},1,"100% Increase",{"$f":"H2*F3","v":19.53},{"$f":"I2*F3","v":18.93},{"$f":"J2*F3","v":18.774999999999999},{"$f":"K2*F3","v":18.62},null,"KingQuarterly",{"$f":"H7/4","v":10155.6}]
[3,73120.320000000007,70873.919999999998,70293.600000000006,69713.279999999999,null,"Adminstrator ISS Regression Hrly Rate",{"$f":"ROUND(SUM(H2:H3),2)","v":39.06},{"$f":"ROUND(SUM(I2:I3),2)","v":37.86},{"$f":"ROUND(SUM(J2:J3),2)","v":37.549999999999997},{"$f":"ROUND(SUM(K2:K3),2)","v":37.24},null,"MSA/NON-MSAMonthly",{"$f":"J7/12","v":3254.3333333333335}]
[4,69058.080000000002,66936.479999999996,66388.399999999994,65840.319999999992,null,null,null,null,null,null,null,"MSA/NON-MSAQuarterly",{"$f":"J7/4","v":9763}]
[5,64995.840000000004,62999.040000000001,62483.199999999997,61967.360000000001,null,"ISS FTE Annual Hours",2080,2080,2080,2080,null,"MSAMonthly",{"$f":"I7/12","v":3281.2000000000003}]
[6,60933.600000000006,59061.600000000006,58578,58094.399999999994,null,"Annual ISS FTE Wages",{"$f":"H2*H6","v":40622.400000000001},{"$f":"I2*I6","v":39374.400000000001},{"$f":"J2*J6","v":39052},{"$f":"K2*K6","v":38729.599999999999},null,"MSAQuarterly",{"$f":"I7/4","v":9843.6}]
[7,56871.360000000001,55124.160000000003,54672.800000000003,54221.440000000002,null,null,null,null,null,null,null,"NON-MSAMonthly",{"$f":"K7/12","v":3227.4666666666667}]
[8,52809.120000000003,51186.720000000001,50767.6,50348.479999999996,null,null,null,null,null,null,null,"NON-MSAQuarterly",{"$f":"K7/4","v":9682.4}]
[9,48746.880000000005,47249.279999999999,46862.399999999994,46475.519999999997]
{"$rows_left_out":50}
{"sheet":"RES","index":3,"n_rows":62,"n_cols":47,"rows_kept":62,"cut":false,"hidden":true,"merged":[[0,0,4,0],[0,7,4,7],[6,0,6,1]]}
[" ","FILE:",{"$f":"MID(CELL(\"filename\",A1),FIND(\"[\",CELL(\"filename\",A1))+1,FIND(\".\",CELL(\"filename\",A1),FIND(\"[\",CELL(\"filename\",A1))+1)-FIND(\"[\",CELL(\"filename\",A1))-1)","v":"2019 ABC Sample - Cost Report"},{"$f":"MID(CELL(\"filename\",B1),FIND(\"[\",CELL(\"filename\",B1))+1,FIND(\".\",CELL(\"filename\",B1),FIND(\"[\",CELL(\"filename\",B1))+1)-FIND(\"[\",CELL(\"filename\",B1))-1)","v":"2019 ABC Sample - Cost Report"},{"$f":"MID(CELL(\"filename\",C1),FIND(\"[\",CELL(\"filename\",C1))+1,FIND(\".\",CELL(\"filename\",C1),FIND(\"[\",CELL(\"filename\",C1))+1)-FIND(\"[\",CELL(\"filename\",C1))-1)","v":"2019 ABC Sample - Cost Report"}]
[null,"PROVIDER ID:",{"$f":"_C000002","v":555777999},{"$f":"_C000002","v":555777999},{"$f":"_C000002","v":555777999}]
[null,"PROVIDER NAME:",{"$f":"_M000001","v":"3S - ABC Residential Services"},{"$f":"_M000001","v":"3S - ABC Residential Services"},{"$f":"_M000001","v":"3S - ABC Residential Services"}]
[null,"CITY, ZIP:",{"$f":"_M000005","v":"Small Town, WA  99901"},{"$f":"_M000005","v":"Small Town, WA  99901"},{"$f":"_M000005","v":"Small Town, WA  99901"}]
[null,"PURCHASED PROFESSIONAL SERVICES",{"$f":"'C - Non-ISS Expenses'!$H$9","v":"Yes"},{"$f":"'C - Non-ISS Expenses'!$H$9","v":"Yes"},{"$f":"'C - Non-ISS Expenses'!$H$9","v":"Yes"}]
["Line","PROGRAM TYPE","TOTAL SUPPORTED LIVING","TOTAL GROUP HOME & GROUP TRAINING HOME","TOTAL ALL PROGRAMS",{"$f":"'C - Non-ISS Expenses'!_M000101","v":"SL Supported Living"},{"$f":"'C - Non-ISS Expenses'!_M000102","v":"GH Group Home"},{"$f":"'C - Non-ISS Expenses'!_M000105","v":"GTH Group Training Home"}]
[null,null,null,null,null,{"$f":"IF(_M001748=\"SL Supported Living\",1,IF(_M001748=\"GH Group Home\",2,IF(_M001748=\"GTH Group Training Home\",3,0)))","v":1},{"$f":"IF(_M001749=\"SL Supported Living\",1,IF(_M001749=\"GH Group Home\",2,IF(_M001749=\"GTH Group Training Home\",3,0)))","v":2},{"$f":"IF(_M001752=\"SL Supported Living\",1,IF(_M001752=\"GH Group Home\",2,IF(_M001752=\"GTH Group Training Home\",3,0)))","v":3}]
[1,"ISS & PROFESSIONAL SERVICES STAFF REGULAR TIME PAYROLL EXPENSES ",{"$f":"SUMIF($F$7:$H$7,1,F8:H8)","v":1247732.1747879104},{"$f":"(SUMIF($F$7:$H$7,2,F8:H8))+(SUMIF($F$7:$H$7,3,F8:H8))","v":827082.94521208911},{"$f":"SUM(F8:H8)","v":2074815.1199999996},{"$f":"('B - ISS Payroll Expenses'!$S$73+'B - ISS Payroll Expenses'!$S$74-'B - ISS Payroll Expenses'!$F$73-'B - ISS Payroll Expenses'!$F$74)*(F48/_C002601)","v":1247732.1747879104},{"$f":"('B - ISS Payroll Expenses'!$S$73+'B - ISS Payroll Expenses'!$S$74-'B - ISS Payroll Expenses'!$F$73-'B - ISS Payroll Expenses'!$F$74)*(G48/_C002601)","v":464427.88895126665},{"$f":"('B - ISS Payroll Expenses'!$S$73+'B - ISS Payroll Expenses'!$S$74-'B - ISS Payroll Expenses'!$F$73-'B - ISS Payroll Expenses'!$F$74)*(H48/_C002601)","v":362655.05626082246}]
[2,"ISS & PROFESSIONAL SERVICES STAFF OVERTIME PAYROLL EXPENSES ",76475.89922540843,50693.500774591535,127169.39999999997,{"$f":"('B - ISS Payroll Expenses'!$F$73+'B - ISS Payroll Expenses'!$F$74)*(_C002602/_C002601)","v":76475.89922540843},{"$f":"('B - ISS Payroll Expenses'!$F$73+'B - ISS Payroll Expenses'!$F$74)*(_C002603/_C002601)","v":28465.67648938244},{"$f":"('B - ISS Payroll Expenses'!$F$73+'B - ISS Payroll Expenses'!$F$74)*(_C002606/_C002601)","v":22227.824285209099}]
[3,"ALLOWABLE GH ADMINISTRATOR ISS REGULAR TIME PAYROLL EXPENSES (GROUP HOME ONLY)",0,0,0,{"$f":"('B - ISS Payroll Expenses'!$S$75-'B - ISS Payroll Expenses'!$F$75)*(_C002602/_C002601)","v":0},{"$f":"('B - ISS Payroll Expenses'!$S$75-'B - ISS Payroll Expenses'!$F$75)*(_C002603/_C002601)","v":0},{"$f":"('B - ISS Payroll Expenses'!$S$75-'B - ISS Payroll Expenses'!$F$75)*(_C002606/_C002601)","v":0}]
{"$rows_left_out":53}
{"sheet":"ReadMe","index":4,"n_rows":34,"n_cols":4,"rows_kept":34,"cut":false,"hidden":false,"merged":[[0,0,0,4],[1,1,1,3],[2,1,2,3],[25,1,25,3],[26,2,26,3],[17,1,17,3],[19,1,19,3],[21,1,21,3],[23,1,23,3],[7,1,7,3],[9,1,9,3],[13,1,13,3],[15,1,15,3],[5,1,5,3],[3,1,3,3],[11,1,11,3]]}
[]
[null,"DDA Residential Programs Cost Report General Guidelines"]
[]
[null,"1. For 2019, a revised cost report has been developed to accomodate the tiered rate methodology system implemented 1/1/19. The department no longer settles on ISS hours, just ISS reimbursements. Agencies no longer need to track the hours employees attend CRST training (formerly 1163 training) as 80% of these funds will become part of the ISS settlement beginning in 2019, while 20% will remain in the Non-ISS/Admin cost center. The overtime consideration credit will not be extended to 2019 settlements because we no longer settle on hours. Schedule C used for reporting Non-ISS expenses does not provide a way for allocating costs between contracted and non-contracted. If an agency needs to allocate Non-ISS/Administrative costs they can use the (optional) Schedule I to do so. Schedule I can also be used to track ISS reimbursements recieived from COCA's. Schedule A must be revised with the current date each time a cost report is submitted. "]
[]
[null,"2. The completed cost report must be submitted in excel format using the 12/2019 revised cost report template. The cost report schedules (A, B, C, D, E, F, & G) are all in a single file. The completed report is to be emailed to both your resource manager and rate analyst (see below for rate analyst). The department no longer accepts Cost Report templates and survey templates from previous years. The current year cost report templates and related materials are available on the web. In addition, cost reports received in PDF or by mail cannot be accepted; only the signed Schedule A is to be scanned as PDF and attached to the email submitting the cost report. If scanning Schedule A is not possible, the signed form (Schedule A only) may be mailed or faxed to your regional resource manager. The resource manager will forward the signed Schedule A to the rates department if mailed or faxed."]
[]
[null,"3. Providers are to fill in cells that are formatted white. Cells that are formatted in yellow are locked and cannot be changed. Several places throughout the cost report, providers will select from a drop down list instead of typing in their information. Do not copy and paste while using this form."]
[]
[null,"4. Do not include client names, identification numbers, or identifying employee information in the cost report. If you use the optional form, Schedule H - Rate History, do not submit it with your cost report. This form, once complete, will list client names and identification numbers. The form is a separate file from the cost report template and providers have the option of using it to complete their cost report. Providers that choose to use this optional form will need to enter the necessary information throughout the year using their Exhibit C's and COCA's."]
{"$rows_left_out":25}
{"sheet":"A - General Info & Cert","index":5,"n_rows":35,"n_cols":4,"rows_kept":35,"cut":false,"hidden":false,"merged":[[28,2,28,3],[2,1,2,4],[27,1,27,3],[5,1,5,2],[24,1,24,3],[7,3,7,4],[9,3,9,4],[11,1,11,4],[13,3,13,4],[15,2,15,4],[19,3,19,4],[26,2,26,3],[0,1,0,4],[5,3,5,4],[17,3,17,4],[25,2,25,3],[22,1,22,3]]}
[null,"SCHEDULE  A"]
[]
[]
[null,"PART A - PROVIDER IDENTIFYING INFORMATION"]
[null,"1. PROVIDER AGENCY NAME",null,"2. PROVIDER ONE ID"]
[null,"3S - ABC Residential Services",null,{"$f":"IF(_M000001=\"\",\"\",VLOOKUP(_M000001,Lists!$A$4:$B$138,2,FALSE))","v":555777999}]
[null,"3. PROVIDER MAILING ADDRESS","4. CITY, ZIP ","5. PROVIDER PHONE NUMBER"]
[null,"123 Main Street","Small Town, WA  99901","360-555-5555"]
[null,"6. ADMINISTRATOR","7. E-MAIL ADDRESS","8. DDA REGION ID"]
[null,"Joe Smith","jsmith@gmail.com",{"$f":"LEFT(_M000001,2)","v":"3S"}]
{"$rows_left_out":26}
{"sheet":"B - ISS Payroll Expenses","index":6,"n_rows":80,"n_cols":21,"rows_kept":80,"cut":false,"hidden":false,"merged":[[9,3,9,20],[0,1,0,20],[2,3,7,18],[2,19,2,20],[12,3,14,3],[17,3,19,3],[22,3,24,3],[27,3,29,3],[32,3,34,3],[37,3,39,3],[72,3,74,3],[67,3,69,3],[42,3,44,3],[47,3,49,3],[62,3,64,3],[57,3,59,3],[52,3,54,3]]}
[null,"SCHEDULE B"]
[]
[null,null,null,"MONTHLY OR QUARTERLY PAYROLL REPORTING",null,null,null,null,null,null,null,null,null,null,null,null,null,null,null,{"$f":"_M000001","v":"3S - ABC Residential Services"}]
[null,null,null,null,null,null,null,null,null,null,null,null,null,null,null,null,null,null,null,"PROVIDER NAME"]
[]
[]
[]
[]
[]
[null,"Monthly","Reporting Period (Select from drop down list)","PROVIDER MUST MAINTAIN SUPPORTING PAYROLL RECORDS FOR AMOUNTS REPORTED EACH MONTH/QUARTER (BY EMPLOYEE) - AVAILABLE UPON REQUEST"]
{"$rows_left_out":71}
{"sheet":"C - Non-ISS Expenses","index":7,"n_rows":46,"n_cols":8,"rows_kept":46,"cut":false,"hidden":false,"merged":[[24,4,26,4],[0,1,0,8],[28,2,28,3],[20,3,20,7],[15,3,15,5],[17,3,17,5],[19,3,19,5],[24,1,26,3],[2,6,2,8],[21,2,21,7],[9,2,9,6],[24,7,24,8],[25,7,26,8],[25,6,26,6],[25,5,26,5],[32,2,32,3],[27,1,27,3],[28,7,28,8],[30,7,30,8],[27,7,27,8],[30,2,30,3],[32,7,32,8],[29,2,29,8],[31,2,31,8],[43,1,43,3],[36,1,36,3],[34,2,34,3],[39,7,39,8],[37,2,37,3],[41,7,41,8],[43,7,43,8],[34,7,34,8],[36,7,36,8],[37,7,37,8],[39,2,39,3],[41,2,41,3],[33,2,33,8],[35,2,35,8],[38,2,38,8],[40,2,40,8],[42,2,42,8]]}
[null,"SCHEDULE C"]
[]
[null,null,null,null,null,null,{"$f":"_M000001","v":"3S - ABC Residential Services"}]
[null,null,null,null,null,null,"PROVIDER NAME"]
[]
[]
[]
[]
[null,1,"ARE PROFESSIONAL SERVICES CONTRACTED OR PURCHASED FOR CLIENTS SUPPORTED BY THE AGENCY?",null,null,null,null,"Yes"]
[null,null,"If Yes, include the cost of purchased professional services for settled programs on Schedule G, line 29-31. Professional Services Staff are Contracted or purchased professional services must be authorized in the client assessment. Provider must have supporting documentation for amounts reported and made available upon request."]
{"$rows_left_out":37}
{"sheet":"D - Revenue","index":8,"n_rows":16,"n_cols":8,"rows_kept":16,"cut":false,"hidden":false,"merged":[[13,1,13,3],[11,2,11,3],[12,2,12,7],[0,1,0,7],[7,2,7,3],[8,2,8,7],[9,2,9,3],[10,2,10,7],[5,4,6,4],[2,6,2,7],[1,2,1,3],[3,2,3,3],[5,1,6,3]]}
[null,"SCHEDULE D"]
[]
[null,null,null,null,null,null,{"$f":"_M000001","v":"3S - ABC Residential Services"}]
[null,null,null,null,null,null,"PROVIDER NAME"]
[]
[null,"RESIDENTIAL SERVICES REVENUE",null,null,"TOTALS","A","B","C"]
[null,null,null,null,null,{"$f":"'C - Non-ISS Expenses'!_M000101","v":"SL Supported Living"},{"$f":"'C - Non-ISS Expenses'!_M000102","v":"GH Group Home"},{"$f":"'C - Non-ISS Expenses'!_M000105","v":"GTH Group Training Home"}]
[null,1,"REVENUE FOR SERVICES PROVIDED",null,{"$f":"SUM(F8:H8)","v":2689236.31},1622205.64,608645.42000000004,458385.25]
[null,null,"State Payments/Reimbursements for ISS/DSHS Clients (Total Daily Rate), ISS/DSHS Client Participation, Prior Years Settlements Deducted from State Payments, Non DSHS Client Payments"]
[null,2,"OTHER OPERATING REVENUE",null,{"$f":"SUM(F10:H10)","v":19950},15750,2000,2200]
{"$rows_left_out":7}
{"sheet":"E - Residential Staffing","index":9,"n_rows":84,"n_cols":14,"rows_kept":84,"cut":false,"hidden":false,"merged":[[72,7,72,8],[70,5,70,6],[71,5,71,6],[72,5,72,6],[72,2,72,4],[70,7,70,8],[71,7,71,8],[70,2,70,4],[71,2,71,4],[17,2,17,3],[18,2,18,3],[19,2,19,3],[32,2,32,11],[26,2,26,11],[29,2,29,11],[36,2,36,11],[67,2,67,4],[68,2,68,4],[66,1,66,8],[41,2,41,11],[42,2,42,11],[43,2,43,11],[39,2,39,11],[51,2,51,7],[37,2,37,11],[38,2,38,11],[68,5,68,6],[44,2,44,11],[49,2,49,7],[50,2,50,7],[48,2,48,7],[0,1,0,13],[6,0,6,14],[12,5,12,10],[13,5,13,10],[40,2,40,11],[2,12,2,13],[3,12,3,13],[7,0,7,14],[13,2,13,4],[12,2,12,4],[23,2,23,11],[24,2,24,11],[25,2,25,11],[35,2,35,11],[33,2,33,11],[16,2,16,3],[82,1,82,13],[81,1,81,13],[75,10,79,13],[75,8,75,9],[75,2,75,5],[78,2,78,5],[79,2,79,5],[76,6,76,7],[76,8,76,9],[77,6,77,7],[77,2,77,5],[76,2,76,5],[69,2,69,4],[56,7,56,10],[57,7,57,10],[67,7,67,8],[68,7,68,8],[69,5,69,6],[69,7,69,8],[67,5,67,6],[56,1,57,2],[74,1,74,9],[83,1,83,13],[16,5,16,10],[17,5,17,10],[18,5,18,10],[19,5,19,10],[22,2,22,10],[75,6,75,7],[55,1,55,13],[34,2,34,11],[77,8,77,9],[78,6,78,7],[78,8,78,9],[79,6,79,7],[79,8,79,9],[47,2,47,7]]}
[null,"SCHEDULE E"]
[]
[null,null,null,null,null,null,null,null,null,null,null,null,{"$f":"'G - ISS Settlement'!C3","v":"3S - ABC Residential Services"}]
[null,null,null,null,null,null,null,null,null,null,null,null,"PROVIDER NAME"]
[]
[]
["IMPORTANT , PLEASE READ before completing schedule:\nCOMPLETE A SEPARATE SCHEDULE FOR EACH LOCATION BY: PROGRAM TYPE, CITY, AND COUNTY \nFOR ADDITIONAL COPIES OF SCHEDULE E CONTACT YOUR AGENCY'S RATE ANALYST \nReporting Period: January 1, 2019 to December 31, 2019 (One Calendar Year, 12 months, 2019)                                                                                                                                                                                                                                                                                                                                                                                                                                                                                                                                                                                                                                                     "]
["The schedule(s) will be reviewed by the rate analyst to ensure the Agency is rporting contracts, programs, and locations separately. \nAny cost reports found to be incomplete will be returned to the agency for correction."]
[]
[null,"1. AGENCY INFORMATION:"]
{"$rows_left_out":75}
{"sheet":"E - Residential Staffing Add'l","index":10,"n_rows":84,"n_cols":14,"rows_kept":84,"cut":false,"hidden":false,"merged":[[81,1,81,13],[82,1,82,13],[83,1,83,13],[77,8,77,9],[78,2,78,5],[78,6,78,7],[78,8,78,9],[79,2,79,5],[79,6,79,7],[79,8,79,9],[74,1,74,9],[75,2,75,5],[75,6,75,7],[75,8,75,9],[75,10,79,13],[76,2,76,5],[76,6,76,7],[76,8,76,9],[77,2,77,5],[77,6,77,7],[71,2,71,4],[71,5,71,6],[71,7,71,8],[72,2,72,4],[72,5,72,6],[72,7,72,8],[69,2,69,4],[69,5,69,6],[69,7,69,8],[70,2,70,4],[70,5,70,6],[70,7,70,8],[66,1,66,8],[67,2,67,4],[67,5,67,6],[67,7,67,8],[68,2,68,4],[68,5,68,6],[68,7,68,8],[56,1,57,2],[56,7,56,10],[57,7,57,10],[40,2,40,11],[41,2,41,11],[42,2,42,11],[43,2,43,11],[44,2,44,11],[47,2,47,7],[48,2,48,7],[49,2,49,7],[50,2,50,7],[51,2,51,7],[55,1,55,13],[39,2,39,11],[24,2,24,11],[25,2,25,11],[26,2,26,11],[29,2,29,11],[32,2,32,11],[33,2,33,11],[34,2,34,11],[35,2,35,11],[36,2,36,11],[37,2,37,11],[38,2,38,11],[23,2,23,11],[13,2,13,4],[13,5,13,10],[16,2,16,3],[16,5,16,10],[17,2,17,3],[17,5,17,10],[18,2,18,3],[18,5,18,10],[19,2,19,3],[19,5,19,10],[22,2,22,10],[12,2,12,4],[12,5,12,10],[0,1,0,13],[2,12,2,13],[3,12,3,13],[6,0,6,14],[7,0,7,14]]}
[null,"SCHEDULE E"]
[]
[null,null,null,null,null,null,null,null,null,null,null,null,{"$f":"'G - ISS Settlement'!C3","v":"3S - ABC Residential Services"}]
[null,null,null,null,null,null,null,null,null,null,null,null,"PROVIDER NAME"]
[]
[]
["IMPORTANT , PLEASE READ before completing schedule:\nCOMPLETE A SEPARATE SCHEDULE FOR EACH LOCATION BY: PROGRAM TYPE, CITY, AND COUNTY \nFOR ADDITIONAL COPIES OF SCHEDULE E CONTACT YOUR AGENCY'S RATE ANALYST \nReporting Period: January 1, 2019 to December 31, 2019 (One Calendar Year, 12 months, 2019)                                                                                                                                                                                                                                                                                                                                                                                                                                                                                                                                                                                                                                                     "]
["The schedule(s) will be reviewed by the rate analyst to ensure the Agency is rporting contracts, programs, and locations separately. \nAny cost reports found to be incomplete will be returned to the agency for correction."]
[]
[null,"1. AGENCY INFORMATION:"]
{"$rows_left_out":75}
{"sheet":"F - Healthcare Expenses","index":11,"n_rows":43,"n_cols":11,"rows_kept":43,"cut":false,"hidden":false,"merged":[[17,4,17,8],[18,4,18,8],[19,4,19,8],[41,1,41,8],[27,9,27,10],[28,9,28,10],[30,9,30,10],[31,9,31,10],[32,9,32,10],[28,1,28,8],[27,1,27,8],[40,1,40,10],[35,1,36,4],[38,1,39,4],[33,9,33,10],[20,4,20,8],[0,1,0,10],[24,9,24,10],[26,9,26,10],[25,9,25,10],[3,9,3,10],[24,1,24,8],[25,1,25,8],[26,1,26,8],[6,0,6,11],[9,1,9,2],[8,9,8,10],[9,4,9,8],[10,4,10,8],[11,4,11,8],[5,0,5,11],[2,9,2,10],[10,1,10,2],[11,1,11,2],[12,1,12,2],[13,1,13,2],[12,4,12,8],[13,4,13,8],[42,1,42,10],[29,9,29,10],[41,9,41,10],[29,1,29,8],[30,1,30,8],[31,1,31,8],[32,1,32,8],[33,1,33,8],[34,1,34,10],[37,1,37,10]]}
[null,"SCHEDULE F"]
[]
[null,null,null,null,null,null,null,null,null,{"$f":"'G - ISS Settlement'!C3","v":"3S - ABC Residential Services"}]
[null,null,null,null,null,null,null,null,null,"PROVIDER NAME"]
[]
["INCLUDE ALL PROGRAMS FOR THE AGENCY ON THIS SCHEDULE"]
["Reporting Period: Dececmber 1, 2019  to  December 31, 2019 (One Month)"]
[null,"PROVIDER INFORMATION:"]
[null,null,null,null,null,null,null,null,null,"Where are the Client Services Provided?"]
[null,"PROGRAM TYPE",null,"PROVIDER NUMBER","PROGRAM NAME",null,null,null,null,"CITY   ","COUNTY   "]
{"$rows_left_out":34}
{"sheet":"G - ISS Settlement","index":12,"n_rows":46,"n_cols":6,"rows_kept":46,"cut":false,"hidden":false,"merged":[[0,0,0,2],[35,0,35,2],[6,0,6,2],[39,1,39,2],[24,0,24,2],[33,0,33,2]]}
["SCHEDULE G"]
[null," "]
[null,null,{"$f":"_M000001","v":"3S - ABC Residential Services"}]
[null,null,"PROVIDER NAME"]
[]
["A","B","C"]
["REIMBURSEMENT SUMMARY"]
["Line","Tiered ISS by Program Type","ISS Reimbursement"]
[1,"SL Supported Living",1314015.48,null,{"$f":"IF(B9=\"GH Group Home\",2,IF(B9=\"GTH Group Training Home\",3,IF(B9=\"SL Supported Living\",1,\"NA\")))","v":1}]
[{"$f":"A9+1","v":2},"GH Group Home",494316.31,null,{"$f":"IF(B10=\"GH Group Home\",2,IF(B10=\"GTH Group Training Home\",3,IF(B10=\"SL Supported Living\",1,\"NA\")))","v":2}]
{"$rows_left_out":36}