{"text_format":"1","workbook":"xlsx","n_sheets":7,"sheets":["2019 JAN","Exhibit","2019 JUN","COCA"," YE Schedule H Rate History","2020 JAN","List"],"not_rendered":{"charts":0,"images":2,"macros":0,"external_links":13,"defined_names":10724,"comments":5,"pivot_tables":0},"unopened":[],"bounds":{"document_bytes":16777216,"sheet_cells":100000,"rows_first":2000,"rows_last":500,"rows_between":2000,"halvings":0,"cell_chars":16384,"cell_head_chars":4096},"cells_cut":0,"cells_raw":0,"read":"whole","date_system":"1900"}

{"sheet":"2019 JAN","index":0,"n_rows":45,"n_cols":49,"rows_kept":45,"cut":false,"hidden":false,"merged":[[0,43,0,45],[1,0,1,2],[1,3,1,4],[1,5,1,8],[0,0,0,2],[0,3,0,4],[0,5,0,6],[0,7,0,10],[0,11,0,35],[0,36,0,38]]}
["Program Name",null,null,"3S - ABC Residential Services",null,"Provider ID",null,{"$f":"VLOOKUP(D1,[13]List!A2:B132,2,FALSE)","v":555777999},null,null,null,"FOR PROVIDER USE ONLY\nDO NOT SUBMIT WITH COST REPORT",null,null,null,null,null,null,null,null,null,null,null,null,null,null,null,null,null,null,null,null,null,null,null,null,"ANNUAL SERVICES\n PAID BY PROGRAM TYPE",null,null,null,{"$f":"IF(AN1=\"\",\"\",AH2+AI2+AJ2)","v":""},null,null,"PROFESSIONAL SERVICES",null,null,null,"Professional Svs Paid Calculation",{"$f":"SUM(AV4:AV40)","v":0}]
["Report Period",null,null,"2019-01-01",null,"2019-12-31",null,null,null,{"$f":"IF($AN$1=\"\",SUM(J4:J39),SUMIF($E$4:$E$39,$AN$1,J4:J39))","v":9490},{"$f":"IF($AN$1=\"\",SUM(K4:K39),SUMIF($E$4:$E$39,$AN$1,K4:K39))","v":26},null,null,null,null,null,null,null,null,null,null,null,null,null,null,null,null,null,null,null,null,null,"Annual Totals",{"$f":"IF($AN$1=\"\",SUM(AH4:AH39),SUMIF($E$4:$E$39,$AN$1,AH4:AH39))","v":2126008.1999999988},39536.800000000003,46026.499999999993,11461,2223032.5,418158.60000000009,15943.200000000008,9909.7500000000036,0,15220.5,29900.799999999999,489132.85000000015,2712165.3500000006,2712165.3500000006,0,9490]
["Client Name (b) ","House or Cluster","Client P1 ID (c)","P1 Service Code/RAC (w)","Program Type","Rate Effective Date (d)","Actual Start Date (Overrides Rate Effective Date)","Rate End Date","Actual End Date (Overrides Rate End Date)","Resid Days Paid","Client Count","ISS Tier Level (e)","ISS Daily Tier Rate (f)","Prof Svs Hrs PCD 1 (g)","Prof Svs Hrly Rate 1 (h)","Prof Svs Hrs PCD 2 (i)","Prof Svs Hrly Rate 2 (j)","Prof Svs Hrs PCD 3","Prof Svs Hrly Rate 3","Prof Svs Hrs PCD 4","Prof Svs Hrly Rate 4","ISS Prof Svs Daily Rate","ISS CRST Tier Rate (l)","ISS Hold Harmless Rate (m)","Total ISS Daily Rate","Admin Tier Rate (o)","Admin Hold Harmless (p)","Admin CRST Tier Rate (q)","Admin Cert Rate (r)","Transportion Rate (s)","Other Non-ISS Rates (t)","Total Non-ISS Daily Rate","Total ISS & Non-ISS Daily Rate","Annual ISS Paid","Annual ISS CRST Paid","Annual ISS Hold Harmless Paid","Annual ISS Prof Svs Paid","Total Annual ISS Paid","Annual Admin Paid","Annual Admin Hold Harmless Paid","Annual Admin CRST Paid","Annual Admin Cert Paid","Annual Transportation Paid","Annual Other Non-ISS Paid","Total Annual Non-ISS Paid","Annual ISS & Non-ISS Paid","Total ISS & Non-ISS Paid per Client","Prof Svs Paid Calculation","Total Days Paid per Client"]
["Client A","House 1",500,"SA722-3603 GH CORE","GH Group Home","2019-01-01",null,"2019-12-31",null,{"$f":"IF(F4>0,+IF(I4>0,I4,H4)-IF(G4>0,G4,F4)+1,0)","v":365},{"$f":"IF(C4<=0,\"\",IF(C4=C3,\"\",1))","v":1},4,291.70999999999998,null,null,null,null,0,0,0,0,{"$f":"+N4*O4+P4*Q4","v":0},5.42,4.8499999999999996,{"$f":"(M4+V4+W4+X4)","v":301.98},57.97,1.68,1.36,0,0,0,{"$f":"SUM(Z4:AE4)","v":61.01},{"$f":"+Y4+AF4","v":362.99},{"$f":"M4*J4","v":106474.15},{"$f":"W4*J4","v":1978.3},{"$f":"X4*J4","v":1770.2499999999998},{"$f":"V4*J4","v":0},{"$f":"$J4*Y4","v":110222.70000000001},{"$f":"$J4*Z4","v":21159.05},{"$f":"$J4*AA4","v":613.19999999999993},{"$f":"$J4*AB4","v":496.40000000000003},{"$f":"$J4*AC4","v":0},{"$f":"J4*AD4","v":0},{"$f":"$J4*AE4","v":0},{"$f":"$J4*AF4","v":22268.649999999998},{"$f":"AL4+AS4","v":132491.35},{"$f":"IF(A5=A4,0,SUMIF($A$4:$A$4802,$A4,AL$4:AL$4802))+IF(A5=A4,0,SUMIF($A$4:$A$4802,$A4,AS$4:AS$4802))","v":132491.35},{"$f":"IF($O4=$AU$1,$N4*$O4*$J4,0)+IF($Q4=$AU$1,$P4*$Q4*$J4,0)","v":0},{"$f":"IF(A5=A4,0,SUMIF($A$4:$A$4802,$A4,J$4:J$4802))+IF(A5=A4,0,SUMIF($A$4:$A$4802,$A4))","v":365}]
["Client B","House 1",501,"SA722-3603 GH CORE","GH Group Home","2019-01-01",null,"2019-12-31",null,365,1,3,223.56,null,null,null,null,0,0,0,0,0,4.16,4.8499999999999996,232.57,56.63,1.68,1.04,0,0,0,59.35,291.92,81599.399999999994,1518.4,1770.2499999999998,0,84888.05,20669.95,613.19999999999993,379.6,0,0,0,21662.75,106550.8,106550.8,0,365]
["Client C","House 1",502,"SA722-3603 GH CORE","GH Group Home","2019-01-01",null,"2019-12-31",null,365,1,3,223.56,null,null,null,null,0,0,0,0,0,4.16,4.8499999999999996,232.57,56.63,1.68,1.04,0,0,0,59.35,291.92,81599.399999999994,1518.4,1770.2499999999998,0,84888.05,20669.95,613.19999999999993,379.6,0,0,0,21662.75,106550.8,106550.8,0,365]
["Client D","House 1",503,"SA722-3603 GH CORE","GH Group Home","2019-01-01",null,"2019-12-31",null,365,1,2,144.81,null,null,null,null,0,0,0,0,0,2.69,4.8499999999999996,152.35,54.84,1.68,0.68,0,0,2.5,59.7,212.05,52855.65,981.85,1770.2499999999998,0,55607.75,20016.600000000002,613.19999999999993,248.20000000000002,0,0,912.5,21790.5,77398.25,77398.25,0,365]
["Client E","House 1",504,"SA722-3905 GTH State","GTH Group Training Home","2019-01-01",null,"2019-12-31",null,365,1,6,441.64,null,null,null,null,0,0,0,0,0,8.2100000000000009,4.8499999999999996,454.7,66.430000000000007,1.68,2.06,0,0,2.5,72.670000000000016,527.37,161198.6,2996.65,1770.2499999999998,0,165965.5,24246.95,613.19999999999993,751.9,0,0,912.5,26524.550000000007,192490.05000000002,192490.05000000002,0,365]
{"$rows_left_out":38}
{"sheet":"Exhibit","index":1,"n_rows":43,"n_cols":24,"rows_kept":43,"cut":false,"hidden":false,"merged":[[2,8,2,10],[3,8,3,10],[5,0,5,23],[3,18,3,23],[3,0,3,6],[2,0,2,6],[2,18,2,23],[3,14,3,16],[2,14,2,16],[8,9,8,10],[8,20,8,21],[8,12,8,18],[8,0,8,7],[6,18,6,19],[7,0,7,7],[7,9,7,10],[7,12,7,18],[7,20,7,21]]}
["Supported Living / Group Home -Exhibit C",null,null,null,null,null,null,null,null,null,"July 1, 2018 - June 30, 2019",null,null,null,null,null,null,null,null,null,"Revision #: 190103"]
[]
["ABC Residential Services",null,null,null,null,null,null,null,"1234-567890",null,null,null,"3S",null,"2019-03-15",null,null,null,31]
["Contractor Name",null,null,null,null,null,null,null,"Contract No.",null,null,null,"Region",null,"Process Date",null,null,null,"No. of Clients (excluding SSP funded)"]
[]
["The undersigned hereby affirm that the following are the agreed upon number of clients and reimbursement rates associated with the indicated contract and contract period. This rate sheet revision supersedes all previous rate sheets as of the effective date."]
[]
[]
{"$rows_left_out":36}
{"sheet":"2019 JUN","index":2,"n_rows":48,"n_cols":49,"rows_kept":48,"cut":false,"hidden":false,"merged":[[0,43,0,45],[1,0,1,2],[1,3,1,4],[1,5,1,8],[0,0,0,2],[0,3,0,4],[0,5,0,6],[0,7,0,10],[0,11,0,35],[0,36,0,38]]}
["Program Name",null,null,"3S - ABC Residential Services",null,"Provider ID",null,{"$f":"VLOOKUP(D1,[13]List!A2:B132,2,FALSE)","v":555777999},null,null,null,"FOR PROVIDER USE ONLY\nDO NOT SUBMIT WITH COST REPORT",null,null,null,null,null,null,null,null,null,null,null,null,null,null,null,null,null,null,null,null,null,null,null,null,"ANNUAL SERVICES\n PAID BY PROGRAM TYPE",null,null,null,{"$f":"IF(AN1=\"\",\"\",AH2+AI2+AJ2)","v":""},null,null,"PROFESSIONAL SERVICES",null,null,null,"Professional Svs Paid Calculation",{"$f":"SUM(AV4:AV43)","v":0}]
["Report Period",null,null,"2019-01-01",null,"2019-12-31",null,null,null,{"$f":"IF($AN$1=\"\",SUM(J4:J42),SUMIF($E$4:$E$42,$AN$1,J4:J42))","v":4556},{"$f":"IF($AN$1=\"\",SUM(K4:K42),SUMIF($E$4:$E$42,$AN$1,K4:K42))","v":29},null,null,null,null,null,null,null,null,null,null,null,null,null,null,null,null,null,null,null,null,null,"Annual Totals",{"$f":"IF($AN$1=\"\",SUM(AH4:AH42),SUMIF($E$4:$E$42,$AN$1,AH4:AH42))","v":1008920.5799999996},18761.419999999995,22096.6,6814.9499999999989,1056593.55,195245.81999999989,7654.08,4704.1499999999996,0,8473.26,15239.389999999998,231316.7,1287910.25,1287910.2499999998,0,4556]
["Client Name (b) ","House or Cluster","Client P1 ID (c)","P1 Service Code/RAC (w)","Program Type","Rate Effective Date (d)","Actual Start Date (Overrides Rate Effective Date)","Rate End Date","Actual End Date (Overrides Rate End Date)","Resid Days Paid","Client Count","ISS Tier Level (e)","ISS Daily Tier Rate (f)","Prof Svs Hrs PCD 1 (g)","Prof Svs Hrly Rate 1 (h)","Prof Svs Hrs PCD 2 (i)","Prof Svs Hrly Rate 2 (j)","Prof Svs Hrs PCD 3","Prof Svs Hrly Rate 3","Prof Svs Hrs PCD 4","Prof Svs Hrly Rate 4","ISS Prof Svs Daily Rate","ISS CRST Tier Rate (l)","ISS Hold Harmless Rate (m)","Total ISS Daily Rate","Admin Tier Rate (o)","Admin Hold Harmless (p)","Admin CRST Tier Rate (q)","Admin Cert Rate (r)","Transportion Rate (s)","Other Non-ISS Rates (t)","Total Non-ISS Daily Rate","Total ISS & Non-ISS Daily Rate","Annual ISS Paid","Annual ISS CRST Paid","Annual ISS Hold Harmless Paid","Annual ISS Prof Svs Paid","Total Annual ISS Paid","Annual Admin Paid","Annual Admin Hold Harmless Paid","Annual Admin CRST Paid","Annual Admin Cert Paid","Annual Transportation Paid","Annual Other Non-ISS Paid","Total Annual Non-ISS Paid","Annual ISS & Non-ISS Paid","Total ISS & Non-ISS Paid per Client","Prof Svs Paid Calculation","Total Days Paid per Client"]
["Client A","House 1",500,"SA722-3603 GH CORE","GH Group Home","2019-01-01",null,"2019-06-30",null,{"$f":"IF(F4>0,+IF(I4>0,I4,H4)-IF(G4>0,G4,F4)+1,0)","v":181},{"$f":"IF(C4<=0,\"\",IF(C4=C3,\"\",1))","v":1},4,291.70999999999998,null,null,null,null,0,0,0,0,{"$f":"+N4*O4+P4*Q4","v":0},5.42,4.8499999999999996,{"$f":"(M4+V4+W4+X4)","v":301.98},57.97,1.68,1.36,0,0,0,{"$f":"SUM(Z4:AE4)","v":61.01},{"$f":"+Y4+AF4","v":362.99},{"$f":"M4*J4","v":52799.509999999995},{"$f":"W4*J4","v":981.02},{"$f":"X4*J4","v":877.84999999999991},{"$f":"V4*J4","v":0},{"$f":"$J4*Y4","v":54658.380000000005},{"$f":"$J4*Z4","v":10492.57},{"$f":"$J4*AA4","v":304.08},{"$f":"$J4*AB4","v":246.16000000000003},{"$f":"$J4*AC4","v":0},{"$f":"J4*AD4","v":0},{"$f":"$J4*AE4","v":0},{"$f":"$J4*AF4","v":11042.81},{"$f":"AL4+AS4","v":65701.19},{"$f":"IF(A5=A4,0,SUMIF($A$4:$A$4805,$A4,AL$4:AL$4805))+IF(A5=A4,0,SUMIF($A$4:$A$4805,$A4,AS$4:AS$4805))","v":65701.19},{"$f":"IF($O4=$AU$1,$N4*$O4*$J4,0)+IF($Q4=$AU$1,$P4*$Q4*$J4,0)","v":0},{"$f":"IF(A5=A4,0,SUMIF($A$4:$A$4805,$A4,J$4:J$4805))+IF(A5=A4,0,SUMIF($A$4:$A$4805,$A4))","v":181}]
["Client B","House 1",501,"SA722-3603 GH CORE","GH Group Home","2019-01-01",null,"2019-06-30",null,181,1,3,223.56,null,null,null,null,0,0,0,0,0,4.16,4.8499999999999996,232.57,56.63,1.68,1.04,0,0,0,59.35,291.92,40464.36,752.96,877.84999999999991,0,42095.17,10250.030000000001,304.08,188.24,0,0,0,10742.35,52837.52,52837.52,0,181]
["Client C","House 1",502,"SA722-3603 GH CORE","GH Group Home","2019-01-01",null,"2019-06-30",null,181,1,3,223.56,null,null,null,null,0,0,0,0,0,4.16,4.8499999999999996,232.57,56.63,1.68,1.04,0,0,0,59.35,291.92,40464.36,752.96,877.84999999999991,0,42095.17,10250.030000000001,304.08,188.24,0,0,0,10742.35,52837.52,52837.52,0,181]
["Client D","House 1",503,"SA722-3603 GH CORE","GH Group Home","2019-01-01",null,"2019-06-30",null,181,1,2,144.81,null,null,null,null,0,0,0,0,0,2.69,4.8499999999999996,152.35,54.84,1.68,0.68,0,0,2.5,59.7,212.05,26210.61,486.89,877.84999999999991,0,27575.35,9926.0400000000009,304.08,123.08000000000001,0,0,452.5,10805.7,38381.050000000003,38381.050000000003,0,181]
["Client E","House 1",504,"SA722-3905 GTH State","GTH Group Training Home","2019-01-01",null,"2019-06-30",null,181,1,6,441.64,null,null,null,null,0,0,0,0,0,8.2100000000000009,4.8499999999999996,454.7,66.430000000000007,1.68,2.06,0,0,2.5,72.670000000000016,527.37,79936.84,1486.0100000000002,877.84999999999991,0,82300.7,12023.830000000002,304.08,372.86,0,0,452.5,13153.270000000002,95453.97,95453.97,0,181]
{"$rows_left_out":41}
{"sheet":"COCA","index":3,"n_rows":36,"n_cols":11,"rows_kept":36,"cut":false,"hidden":false,"merged":[[25,0,25,2],[1,3,1,5],[2,3,2,5],[4,0,4,8],[5,0,5,2],[5,3,5,6],[5,7,5,8],[6,0,6,2],[6,3,6,6],[6,7,6,8],[7,3,7,6],[8,0,8,1],[8,3,8,6],[14,0,14,1],[9,0,9,1],[10,0,10,1],[10,6,10,8],[11,0,11,1],[11,3,11,5],[11,6,11,8],[12,0,12,1],[12,3,12,5],[13,0,13,1],[13,3,13,4],[13,5,13,8],[15,0,15,1],[15,3,15,4],[15,5,15,7],[16,0,16,1],[16,3,16,4],[16,5,16,7],[24,0,24,2],[17,0,17,1],[18,0,18,8],[19,0,19,3],[19,4,19,8],[20,0,20,2],[20,4,20,8],[21,0,21,2],[21,6,21,8],[22,0,22,2],[22,4,22,8],[23,0,23,2],[31,0,31,8],[32,0,33,8],[34,0,34,8],[35,0,35,8],[26,0,26,8],[27,0,27,4],[28,0,28,6],[28,7,28,8],[29,0,29,8],[30,0,30,1]]}
[]
[null,null,null,"Deveopmental Disabilities"]
[null,null,null,"Cost of Care Adjustment"]
[]
["Provider Completes"]
["Absent Client's Name: ",null,null,"Provider Name",null,null,null,"Date Submitted"]
["Client 2",null,null,"ABC Residential Services",null,null,null,"2019-07-15"]
["Affected Housemates",null,"P1 ID","Provider ID"]
{"$rows_left_out":29}
{"sheet":" YE Schedule H Rate History","index":4,"n_rows":63,"n_cols":49,"rows_kept":63,"cut":false,"hidden":false,"merged":[[0,43,0,45],[1,0,1,2],[1,3,1,4],[1,5,1,8],[0,0,0,2],[0,3,0,4],[0,5,0,6],[0,7,0,10],[0,11,0,35],[0,36,0,38]]}
["Program Name",null,null,"3S - ABC Residential Services",null,"Provider ID",null,{"$f":"VLOOKUP(D1,[13]List!A2:B132,2,FALSE)","v":555777999},null,null,null,"FOR PROVIDER USE ONLY\nDO NOT SUBMIT WITH COST REPORT",null,null,null,null,null,null,null,null,null,null,null,null,null,null,null,null,null,null,null,null,null,null,null,null,"ANNUAL SERVICES\n PAID BY PROGRAM TYPE",null,null,null,{"$f":"IF(AN1=\"\",\"\",AH2+AI2+AJ2)","v":""},null,null,"PROFESSIONAL SERVICES",null,null,null,"Professional Svs Paid Calculation",{"$f":"SUM(AV4:AV58)","v":0}]
["Report Period",null,null,"2019-01-01",null,"2019-12-31",null,null,null,{"$f":"IF($AN$1=\"\",SUM(J4:J57),SUMIF($E$4:$E$57,$AN$1,J4:J57))","v":9477},{"$f":"IF($AN$1=\"\",SUM(K4:K57),SUMIF($E$4:$E$57,$AN$1,K4:K57))","v":33},null,null,null,null,null,null,null,null,null,null,null,null,null,null,null,null,null,null,null,null,null,"Annual Totals",{"$f":"IF($AN$1=\"\",SUM(AH4:AH57),SUMIF($E$4:$E$57,$AN$1,AH4:AH57))","v":2109537.8300000005},39241.409999999989,45963.449999999983,14299.15,2209041.8400000003,403723.11,15921.36,9841.4400000000023,0,18381.86,32326.699999999997,480194.47000000003,2689236.3100000005,2689236.31,0,9477]
["Client Name (b) ","House or Cluster","Client P1 ID (c)","P1 Service Code/RAC (w)","Program Type","Rate Effective Date (d)","Actual Start Date (Overrides Rate Effective Date)","Rate End Date","Actual End Date (Overrides Rate End Date)","Resid Days Paid","Client Count","ISS Tier Level (e)","ISS Daily Tier Rate (f)","Prof Svs Hrs PCD 1 (g)","Prof Svs Hrly Rate 1 (h)","Prof Svs Hrs PCD 2 (i)","Prof Svs Hrly Rate 2 (j)","Prof Svs Hrs PCD 3","Prof Svs Hrly Rate 3","Prof Svs Hrs PCD 4","Prof Svs Hrly Rate 4","ISS Prof Svs Daily Rate","ISS CRST Tier Rate (l)","ISS Hold Harmless Rate (m)","Total ISS Daily Rate","Admin Tier Rate (o)","Admin Hold Harmless (p)","Admin CRST Tier Rate (q)","Admin Cert Rate (r)","Transportion Rate (s)","Other Non-ISS Rates (t)","Total Non-ISS Daily Rate","Total ISS & Non-ISS Daily Rate","Annual ISS Paid","Annual ISS CRST Paid","Annual ISS Hold Harmless Paid","Annual ISS Prof Svs Paid","Total Annual ISS Paid","Annual Admin Paid","Annual Admin Hold Harmless Paid","Annual Admin CRST Paid","Annual Admin Cert Paid","Annual Transportation Paid","Annual Other Non-ISS Paid","Total Annual Non-ISS Paid","Annual ISS & Non-ISS Paid","Total ISS & Non-ISS Paid per Client","Prof Svs Paid Calculation","Total Days Paid per Client"]
["Client A","House 1",500,"SA722-3603 GH CORE","GH Group Home","2019-01-01",null,"2019-12-31",null,{"$f":"IF(F4>0,+IF(I4>0,I4,H4)-IF(G4>0,G4,F4)+1,0)","v":365},{"$f":"IF(C4<=0,\"\",IF(C4=C3,\"\",1))","v":1},4,291.70999999999998,null,null,null,null,0,0,0,0,{"$f":"+N4*O4+P4*Q4","v":0},5.42,4.8499999999999996,{"$f":"(M4+V4+W4+X4)","v":301.98},57.97,1.68,1.36,0,0,0,{"$f":"SUM(Z4:AE4)","v":61.01},{"$f":"+Y4+AF4","v":362.99},{"$f":"M4*J4","v":106474.15},{"$f":"W4*J4","v":1978.3},{"$f":"X4*J4","v":1770.2499999999998},{"$f":"V4*J4","v":0},{"$f":"$J4*Y4","v":110222.70000000001},{"$f":"$J4*Z4","v":21159.05},{"$f":"$J4*AA4","v":613.19999999999993},{"$f":"$J4*AB4","v":496.40000000000003},{"$f":"$J4*AC4","v":0},{"$f":"J4*AD4","v":0},{"$f":"$J4*AE4","v":0},22268.649999999998,{"$f":"AL4+AS4","v":132491.35},{"$f":"IF(A5=A4,0,SUMIF($A$4:$A$4820,$A4,AL$4:AL$4820))+IF(A5=A4,0,SUMIF($A$4:$A$4820,$A4,AS$4:AS$4820))","v":132491.35},{"$f":"IF($O4=$AU$1,$N4*$O4*$J4,0)+IF($Q4=$AU$1,$P4*$Q4*$J4,0)","v":0},{"$f":"IF(A5=A4,0,SUMIF($A$4:$A$4820,$A4,J$4:J$4820))+IF(A5=A4,0,SUMIF($A$4:$A$4820,$A4))","v":365}]
["Client B","House 1",501,"SA722-3603 GH CORE","GH Group Home","2019-01-01",null,"2019-06-30",null,181,1,3,223.56,null,null,null,null,0,0,0,0,0,4.16,4.8499999999999996,232.57,56.63,1.68,1.04,0,0,0,{"$f":"SUM(Z5:AE5)","v":59.35},{"$f":"+Y5+AF5","v":291.92},{"$f":"M5*J5","v":40464.36},{"$f":"W5*J5","v":752.96},{"$f":"X5*J5","v":877.84999999999991},{"$f":"V5*J5","v":0},{"$f":"$J5*Y5","v":42095.17},{"$f":"$J5*Z5","v":10250.030000000001},{"$f":"$J5*AA5","v":304.08},{"$f":"$J5*AB5","v":188.24},{"$f":"$J5*AC5","v":0},{"$f":"J5*AD5","v":0},{"$f":"$J5*AE5","v":0},{"$f":"$J5*AF5","v":10742.35},{"$f":"AL5+AS5","v":52837.52},{"$f":"IF(A6=A5,0,SUMIF($A$4:$A$4820,$A5,AL$4:AL$4820))+IF(A6=A5,0,SUMIF($A$4:$A$4820,$A5,AS$4:AS$4820))","v":0},0,{"$f":"IF(A6=A5,0,SUMIF($A$4:$A$4820,$A5,J$4:J$4820))+IF(A6=A5,0,SUMIF($A$4:$A$4820,$A5))","v":0}]
["Client B","House 1",501,"SA722-3603 GH CORE","GH Group Home","2019-07-01",null,"2019-12-31",null,184,"",3,223.56,null,null,null,null,0,0,0,0,0,4.16,4.8499999999999996,232.57,56.63,1.68,1.04,0,0,0,59.35,291.92,41135.040000000001,765.44,892.4,0,42792.88,10419.92,309.12,191.36,0,0,0,10920.4,53713.279999999999,106550.79999999999,0,365]
["Client C","House 1",502,"SA722-3603 GH CORE","GH Group Home","2019-01-01",null,"2019-12-31",null,365,1,3,223.56,null,null,null,null,0,0,0,0,0,4.16,4.8499999999999996,232.57,56.63,1.68,1.04,0,0,0,59.35,291.92,81599.399999999994,1518.4,1770.2499999999998,0,84888.05,20669.95,613.19999999999993,379.6,0,0,0,21662.75,106550.8,106550.8,0,365]
["Client D","House 1",503,"SA722-3603 GH CORE","GH Group Home","2019-01-01",null,"2019-06-30",null,181,1,2,144.81,null,null,null,null,0,0,0,0,0,2.69,4.8499999999999996,152.35,54.84,1.68,0.68,0,0,2.5,59.7,212.05,26210.61,486.89,877.84999999999991,0,27575.35,9926.0400000000009,304.08,123.08000000000001,0,0,452.5,10805.7,38381.050000000003,0,0,0]
{"$rows_left_out":56}
{"sheet":"2020 JAN","index":5,"n_rows":43,"n_cols":49,"rows_kept":43,"cut":false,"hidden":false,"merged":[[0,43,0,45],[1,0,1,2],[1,3,1,4],[1,5,1,8],[0,0,0,2],[0,3,0,4],[0,5,0,6],[0,7,0,10],[0,11,0,35],[0,36,0,38]]}
["Program Name",null,null,"3S - ABC Residential Services",null,"Provider ID",null,{"$f":"VLOOKUP(D1,[13]List!A2:B132,2,FALSE)","v":555777999},null,null,null,"FOR PROVIDER USE ONLY\nDO NOT SUBMIT WITH COST REPORT",null,null,null,null,null,null,null,null,null,null,null,null,null,null,null,null,null,null,null,null,null,null,null,null,"ANNUAL SERVICES\n PAID BY PROGRAM TYPE",null,null,null,{"$f":"IF(AN1=\"\",\"\",AH2+AI2+AJ2)","v":""},null,null,"PROFESSIONAL SERVICES",null,null,null,"Professional Svs Paid Calculation",{"$f":"SUM(AV4:AV38)","v":0}]
["Report Period",null,null,"2020-01-01",null,"2020-12-31",null,null,null,{"$f":"IF($AN$1=\"\",SUM(J4:J37),SUMIF($E$4:$E$37,$AN$1,J4:J37))","v":9882},{"$f":"IF($AN$1=\"\",SUM(K4:K37),SUMIF($E$4:$E$37,$AN$1,K4:K37))","v":27},null,null,null,null,null,null,null,null,null,null,null,null,null,null,null,null,null,null,null,null,null,"Annual Totals",{"$f":"IF($AN$1=\"\",SUM(AH4:AH37),SUMIF($E$4:$E$37,$AN$1,AH4:AH37))","v":2209223.5799999996},41076.180000000008,47927.699999999975,14887.05,2313114.5100000012,418074.48000000021,16601.759999999991,10306.56,0,19280.88,36826.920000000006,501090.59999999992,2814205.1100000008,2814205.1100000008,0,9882]
["Client Name (b) ","House or Cluster","Client P1 ID (c)","P1 Service Code/RAC (w)","Program Type","Rate Effective Date (d)","Actual Start Date (Overrides Rate Effective Date)","Rate End Date","Actual End Date (Overrides Rate End Date)","Resid Days Paid","Client Count","ISS Tier Level (e)","ISS Daily Tier Rate (f)","Prof Svs Hrs PCD 1 (g)","Prof Svs Hrly Rate 1 (h)","Prof Svs Hrs PCD 2 (i)","Prof Svs Hrly Rate 2 (j)","Prof Svs Hrs PCD 3","Prof Svs Hrly Rate 3","Prof Svs Hrs PCD 4","Prof Svs Hrly Rate 4","ISS Prof Svs Daily Rate","ISS CRST Tier Rate (l)","ISS Hold Harmless Rate (m)","Total ISS Daily Rate","Admin Tier Rate (o)","Admin Hold Harmless (p)","Admin CRST Tier Rate (q)","Admin Cert Rate (r)","Transportion Rate (s)","Other Non-ISS Rates (t)","Total Non-ISS Daily Rate","Total ISS & Non-ISS Daily Rate","Annual ISS Paid","Annual ISS CRST Paid","Annual ISS Hold Harmless Paid","Annual ISS Prof Svs Paid","Total Annual ISS Paid","Annual Admin Paid","Annual Admin Hold Harmless Paid","Annual Admin CRST Paid","Annual Admin Cert Paid","Annual Transportation Paid","Annual Other Non-ISS Paid","Total Annual Non-ISS Paid","Annual ISS & Non-ISS Paid","Total ISS & Non-ISS Paid per Client","Prof Svs Paid Calculation","Total Days Paid per Client"]
["Client A","House 1",500,"SA722-3603 GH CORE","GH Group Home","2020-01-01",null,"2020-12-31",null,{"$f":"IF(F4>0,+IF(I4>0,I4,H4)-IF(G4>0,G4,F4)+1,0)","v":366},{"$f":"IF(C4<=0,\"\",IF(C4=C3,\"\",1))","v":1},4,291.70999999999998,null,null,null,null,0,0,0,0,{"$f":"+N4*O4+P4*Q4","v":0},5.42,4.8499999999999996,{"$f":"(M4+V4+W4+X4)","v":301.98},57.97,1.68,1.36,0,0,0,{"$f":"SUM(Z4:AE4)","v":61.01},{"$f":"+Y4+AF4","v":362.99},{"$f":"M4*J4","v":106765.85999999999},{"$f":"W4*J4","v":1983.72},{"$f":"X4*J4","v":1775.1},{"$f":"V4*J4","v":0},{"$f":"$J4*Y4","v":110524.68000000001},{"$f":"$J4*Z4","v":21217.02},{"$f":"$J4*AA4","v":614.88},{"$f":"$J4*AB4","v":497.76000000000005},{"$f":"$J4*AC4","v":0},{"$f":"J4*AD4","v":0},{"$f":"$J4*AE4","v":0},{"$f":"$J4*AF4","v":22329.66},{"$f":"AL4+AS4","v":132854.34},{"$f":"IF(A5=A4,0,SUMIF($A$4:$A$4800,$A4,AL$4:AL$4800))+IF(A5=A4,0,SUMIF($A$4:$A$4800,$A4,AS$4:AS$4800))","v":132854.34},{"$f":"IF($O4=$AU$1,$N4*$O4*$J4,0)+IF($Q4=$AU$1,$P4*$Q4*$J4,0)","v":0},{"$f":"IF(A5=A4,0,SUMIF($A$4:$A$4800,$A4,J$4:J$4800))+IF(A5=A4,0,SUMIF($A$4:$A$4800,$A4))","v":366}]
["Client B","House 1",501,"SA722-3603 GH CORE","GH Group Home","2020-01-01",null,"2020-12-31",null,366,1,3,223.56,null,null,null,null,0,0,0,0,0,4.16,4.8499999999999996,232.57,56.63,1.68,1.04,0,0,0,{"$f":"SUM(Z5:AE5)","v":59.35},{"$f":"+Y5+AF5","v":291.92},{"$f":"M5*J5","v":81822.960000000006},{"$f":"W5*J5","v":1522.56},{"$f":"X5*J5","v":1775.1},{"$f":"V5*J5","v":0},{"$f":"$J5*Y5","v":85120.62},{"$f":"$J5*Z5","v":20726.580000000002},{"$f":"$J5*AA5","v":614.88},{"$f":"$J5*AB5","v":380.64},{"$f":"$J5*AC5","v":0},{"$f":"J5*AD5","v":0},{"$f":"$J5*AE5","v":0},{"$f":"$J5*AF5","v":21722.100000000002},{"$f":"AL5+AS5","v":106842.72},{"$f":"IF(A6=A5,0,SUMIF($A$4:$A$4800,$A5,AL$4:AL$4800))+IF(A6=A5,0,SUMIF($A$4:$A$4800,$A5,AS$4:AS$4800))","v":106842.72},0,{"$f":"IF(A6=A5,0,SUMIF($A$4:$A$4800,$A5,J$4:J$4800))+IF(A6=A5,0,SUMIF($A$4:$A$4800,$A5))","v":366}]
["Client C","House 1",502,"SA722-3603 GH CORE","GH Group Home","2020-01-01",null,"2020-12-31",null,366,1,3,223.56,null,null,null,null,0,0,0,0,0,4.16,4.8499999999999996,232.57,56.63,1.68,1.04,0,0,0,59.35,291.92,81822.960000000006,1522.56,1775.1,0,85120.62,20726.580000000002,614.88,380.64,0,0,0,21722.100000000002,106842.72,106842.72,0,366]
["Client D","House 1",503,"SA722-3603 GH CORE","GH Group Home","2020-01-01",null,"2020-12-31",null,366,1,2,144.81,null,null,null,null,0,0,0,0,0,2.69,4.8499999999999996,152.35,54.84,1.68,0.68,0,0,0,57.2,209.55,53000.46,984.54,1775.1,0,55760.1,20071.440000000002,614.88,248.88000000000002,0,0,0,20935.2,76695.3,76695.3,0,366]
["Client E","House 1",504,"SA722-3905 GTH State","GTH Group Training Home","2020-01-01",null,"2020-12-31",null,366,1,6,441.64,null,null,null,null,0,0,0,0,0,8.2100000000000009,4.8499999999999996,454.7,66.430000000000007,1.68,2.06,0,0,2.5,72.670000000000016,527.37,161640.24,3004.86,1775.1,0,166420.19999999998,24313.38,614.88,753.96,0,0,915,26597.220000000005,193017.41999999998,193017.41999999998,0,366]
{"$rows_left_out":36}
{"sheet":"List","index":6,"n_rows":139,"n_cols":7,"rows_kept":139,"cut":false,"hidden":true,"merged":[]}
["Provider","Provider ID a.","Benchmark or Avg Benchmark","Urban Designation",null,null,"Program Type"]
[]
["1N - Aacres WA",111414301,18.43,"MSA",null,null,"SL Supported Living"]
["1N - Aacres Spokane 2",111414310,18.43,"MSA",null,null,"GH Group Home"]
["1N - Aacres Spokane 3",111414309,18.43,"MSA",null,null,"GTH Group Training Home"]
["1N - Adult Guidance & Empowerment Service",111684901,18.43,"MSA"]
["1N - Ambitions - Spokane",111901906,18.43,"MSA"]
["1N - Ambitions - Wenatchee, Omak, Moses Lake",111901903,18.274999999999999,"MSA/NON-MSA"]
{"$rows_left_out":131}