{"text_format":"1","workbook":"xlsx","n_sheets":4,"sheets":["Schedule H - Rate History","Reconciliation","Other Codes","List"],"not_rendered":{"charts":0,"images":0,"macros":0,"external_links":11,"defined_names":2724,"comments":1,"pivot_tables":0},"unopened":[],"bounds":{"document_bytes":16777216,"sheet_cells":100000,"rows_first":2000,"rows_last":500,"rows_between":2000,"halvings":0,"cell_chars":16384,"cell_head_chars":4096},"cells_cut":0,"cells_raw":0,"read":"whole","date_system":"1900"}

{"sheet":"Schedule H - Rate History","index":0,"n_rows":403,"n_cols":49,"rows_kept":403,"cut":false,"hidden":false,"merged":[[0,43,0,45],[1,0,1,2],[1,3,1,4],[1,5,1,8],[0,0,0,2],[0,3,0,4],[0,5,0,6],[0,7,0,10],[0,11,0,35],[0,36,0,38],[0,41,0,42]]}
["Program Name",null,null,null,null,"Provider ID",null,{"$f":"VLOOKUP(D1,List!A2:C149,2,FALSE)","v":{"$error":"#N/A"}},null,null,null,"FOR PROVIDER USE ONLY\nDO NOT SUBMIT WITH COST REPORT",null,null,null,null,null,null,null,null,null,null,null,null,null,null,null,null,null,null,null,null,null,null,null,null,"ANNUAL SERVICES\n PAID BY PROGRAM TYPE",null,null,null,{"$f":"IF(AN1=\"\",\"\",AH2+AI2+AJ2)","v":""},null,null,"PROFESSIONAL SERVICES",null,null,null,"Professional Svs Paid Calculation",{"$f":"SUM(AV4:AV398)","v":0}]
["Report Period",null,null,"2020-01-01",null,"2020-12-31",null,null,null,{"$f":"IF($AN$1=\"\",SUM(J4:J397),SUMIF($E$4:$E$397,$AN$1,J4:J397))","v":0},{"$f":"IF($AN$1=\"\",SUM(K4:K397),SUMIF($E$4:$E$397,$AN$1,K4:K397))","v":0},null,null,null,null,null,null,null,null,null,null,null,null,null,null,null,null,null,null,null,null,null,"Annual Totals",{"$f":"IF($AN$1=\"\",SUM(AH4:AH397),SUMIF($E$4:$E$397,$AN$1,AH4:AH397))","v":0},0,0,0,0,0,0,0,0,0,0,0,0,0,0,0]
["Client Name (b) ","COCA Recipient","Client P1 ID (c)","P1 Service Code/RAC (w)","Program Type","Rate Effective Date (d)","Actual Start Date (Overrides Rate Effective Date)","Rate End Date","Actual End Date (Overrides Rate End Date)","Resid Days Paid","Client Count","ISS Tier Level (e)","ISS Daily Tier Rate (f)","Prof Svs Hrs PCD 1 (g)","Prof Svs Hrly Rate 1 (h)","Prof Svs Hrs PCD 2 (i)","Prof Svs Hrly Rate 2 (j)","Prof Svs Hrs PCD 3","Prof Svs Hrly Rate 3","Prof Svs Hrs PCD 4","Prof Svs Hrly Rate 4","ISS Prof Svs Daily Rate","ISS CRST Tier Rate (l)","ISS Hold Harmless Rate (m)","Total ISS Daily Rate","Admin Tier Rate (o)","Admin Hold Harmless (p)","Admin CRST Tier Rate (q)","Admin Cert Rate (r)","Transportation Rate (s)","Other Non-ISS Rates (t)","Total Non-ISS Daily Rate","Total ISS & Non-ISS Daily Rate","Annual ISS Paid","Annual ISS CRST Paid","Annual ISS Hold Harmless Paid","Annual ISS Prof Svs Paid","Total Annual ISS Paid","Annual Admin Paid","Annual Admin Hold Harmless Paid","Annual Admin CRST Paid","Annual Admin Cert Paid","Annual Transportation Paid","Annual Other Non-ISS Paid","Total Annual Non-ISS Paid","Annual ISS & Non-ISS Paid","Total ISS & Non-ISS Paid per Client","Prof Svs Paid Calculation","Total Days Paid per Client"]
[null,null,null,null,null,null,null,null,null,{"$f":"IF(F4>0,+IF(I4>0,I4,H4)-IF(G4>0,G4,F4)+1,0)","v":0},{"$f":"IF(C4<=0,\"\",IF(C4=C3,\"\",1))","v":""},null,null,null,null,null,null,null,null,null,null,{"$f":"ROUND(+N4*O4+P4*Q4,2)","v":0},null,null,{"$f":"(M4+V4+W4+X4)","v":0},null,null,null,null,null,null,{"$f":"SUM(Z4:AE4)","v":0},{"$f":"+Y4+AF4","v":0},{"$f":"M4*J4","v":0},{"$f":"W4*J4","v":0},{"$f":"X4*J4","v":0},{"$f":"ROUND(+N4*O4+P4*Q4,2)*J4","v":0},{"$f":"$J4*Y4","v":0},{"$f":"$J4*Z4","v":0},{"$f":"$J4*AA4","v":0},{"$f":"$J4*AB4","v":0},{"$f":"$J4*AC4","v":0},{"$f":"J4*AD4","v":0},{"$f":"$J4*AE4","v":0},{"$f":"$J4*AF4","v":0},{"$f":"AL4+AS4","v":0},{"$f":"IF(A5=A4,0,SUMIF($A$4:$A$4830,$A4,AL$4:AL$4830))+IF(A5=A4,0,SUMIF($A$4:$A$4830,$A4,AS$4:AS$4830))","v":0},{"$f":"IF($O4=$AU$1,ROUND($N4*$O4,2)*$J4,0)+IF($Q4=$AU$1,ROUND($P4*$Q113,2)*$J4,0)","v":0},{"$f":"IF(A5=A4,0,SUMIF($A$4:$A$4830,$A4,J$4:J$4830))+IF(A5=A4,0,SUMIF($A$4:$A$4830,$A4))","v":0}]
[null,null,null,null,null,null,null,null,null,0,"",null,null,null,null,null,null,null,null,null,null,0,null,null,0,null,null,null,null,null,null,{"$f":"SUM(Z5:AE5)","v":0},{"$f":"+Y5+AF5","v":0},{"$f":"M5*J5","v":0},{"$f":"W5*J5","v":0},{"$f":"X5*J5","v":0},{"$f":"ROUND(+N5*O5+P5*Q5,2)*J5","v":0},{"$f":"$J5*Y5","v":0},{"$f":"$J5*Z5","v":0},{"$f":"$J5*AA5","v":0},{"$f":"$J5*AB5","v":0},{"$f":"$J5*AC5","v":0},{"$f":"J5*AD5","v":0},{"$f":"$J5*AE5","v":0},{"$f":"$J5*AF5","v":0},{"$f":"AL5+AS5","v":0},{"$f":"IF(A6=A5,0,SUMIF($A$4:$A$4830,$A5,AL$4:AL$4830))+IF(A6=A5,0,SUMIF($A$4:$A$4830,$A5,AS$4:AS$4830))","v":0},0,{"$f":"IF(A6=A5,0,SUMIF($A$4:$A$4830,$A5,J$4:J$4830))+IF(A6=A5,0,SUMIF($A$4:$A$4830,$A5))","v":0}]
[null,null,null,null,null,null,null,null,null,0,"",null,null,null,null,null,null,null,null,null,null,0,null,null,0,null,null,null,null,null,null,0,0,0,0,0,0,0,0,0,0,0,0,0,0,0,0,0,0]
[null,null,null,null,null,null,null,null,null,0,"",null,null,null,null,null,null,null,null,null,null,0,null,null,0,null,null,null,null,null,null,0,0,0,0,0,0,0,0,0,0,0,0,0,0,0,0,0,0]
[null,null,null,null,null,null,null,null,null,0,"",null,null,null,null,null,null,null,null,null,null,0,null,null,0,null,null,null,null,null,null,0,0,0,0,0,0,0,0,0,0,0,0,0,0,0,0,0,0]
[null,null,null,null,null,null,null,null,null,0,"",null,null,null,null,null,null,null,null,null,null,0,null,null,0,null,null,null,null,null,null,0,0,0,0,0,0,0,0,0,0,0,0,0,0,0,0,0,0]
[null,null,null,null,null,null,null,null,null,0,"",null,null,null,null,null,null,null,null,null,null,0,null,null,0,null,null,null,null,null,null,0,0,0,0,0,0,0,0,0,0,0,0,0,0,0,0,0,0]
[null,null,null,null,null,null,null,null,null,0,"",null,null,null,null,null,null,null,null,null,null,0,null,null,0,null,null,null,null,null,null,0,0,0,0,0,0,0,0,0,0,0,0,0,0,0,0,0,0]
[null,null,null,null,null,null,null,null,null,0,"",null,null,null,null,null,null,null,null,null,null,0,null,null,0,null,null,null,null,null,null,0,0,0,0,0,0,0,0,0,0,0,0,0,0,0,0,0,0]
[null,null,null,null,null,null,null,null,null,0,"",null,null,null,null,null,null,null,null,null,null,0,null,null,0,null,null,null,null,null,null,0,0,0,0,0,0,0,0,0,0,0,0,0,0,0,0,0,0]
[null,null,null,null,null,null,null,null,null,0,"",null,null,null,null,null,null,null,null,null,null,0,null,null,0,null,null,null,null,null,null,0,0,0,0,0,0,0,0,0,0,0,0,0,0,0,0,0,0]
[null,null,null,null,null,null,null,null,null,0,"",null,null,null,null,null,null,null,null,null,null,0,null,null,0,null,null,null,null,null,null,0,0,0,0,0,0,0,0,0,0,0,0,0,0,0,0,0,0]
[null,null,null,null,null,null,null,null,null,0,"",null,null,null,null,null,null,null,null,null,null,0,null,null,0,null,null,null,null,null,null,0,0,0,0,0,0,0,0,0,0,0,0,0,0,0,0,0,0]
[null,null,null,null,null,null,null,null,null,0,"",null,null,null,null,null,null,null,null,null,null,0,null,null,0,null,null,null,null,null,null,0,0,0,0,0,0,0,0,0,0,0,0,0,0,0,0,0,0]
[null,null,null,null,null,null,null,null,null,0,"",null,null,null,null,null,null,null,null,null,null,0,null,null,0,null,null,null,null,null,null,0,0,0,0,0,0,0,0,0,0,0,0,0,0,0,0,0,0]
[null,null,null,null,null,null,null,null,null,0,"",null,null,null,null,null,null,null,null,null,null,0,null,null,0,null,null,null,null,null,null,0,0,0,0,0,0,0,0,0,0,0,0,0,0,0,0,0,0]
[null,null,null,null,null,null,null,null,null,0,"",null,null,null,null,null,null,null,null,null,null,0,null,null,0,null,null,null,null,null,null,0,0,0,0,0,0,0,0,0,0,0,0,0,0,0,0,0,0]
[null,null,null,null,null,null,null,null,null,0,"",null,null,null,null,null,null,null,null,null,null,0,null,null,0,null,null,null,null,null,null,0,0,0,0,0,0,0,0,0,0,0,0,0,0,0,0,0,0]
[null,null,null,null,null,null,null,null,null,0,"",null,null,null,null,null,null,null,null,null,null,0,null,null,0,null,null,null,null,null,null,0,0,0,0,0,0,0,0,0,0,0,0,0,0,0,0,0,0]
[null,null,null,null,null,null,null,null,null,0,"",null,null,null,null,null,null,null,null,null,null,0,null,null,0,null,null,null,null,null,null,0,0,0,0,0,0,0,0,0,0,0,0,0,0,0,0,0,0]
[null,null,null,null,null,null,null,null,null,0,"",null,null,null,null,null,null,null,null,null,null,0,null,null,0,null,null,null,null,null,null,0,0,0,0,0,0,0,0,0,0,0,0,0,0,0,0,0,0]
[null,null,null,null,null,null,null,null,null,0,"",null,null,null,null,null,null,null,null,null,null,0,null,null,0,null,null,null,null,null,null,0,0,0,0,0,0,0,0,0,0,0,0,0,0,0,0,0,0]
[null,null,null,null,null,null,null,null,null,0,"",null,null,null,null,null,null,null,null,null,null,0,null,null,0,null,null,null,null,null,null,0,0,0,0,0,0,0,0,0,0,0,0,0,0,0,0,0,0]
[null,null,null,null,null,null,null,null,null,0,"",null,null,null,null,null,null,null,null,null,null,0,null,null,0,null,null,null,null,null,null,0,0,0,0,0,0,0,0,0,0,0,0,0,0,0,0,0,0]
[null,null,null,null,null,null,null,null,null,0,"",null,null,null,null,null,null,null,null,null,null,0,null,null,0,null,null,null,null,null,null,0,0,0,0,0,0,0,0,0,0,0,0,0,0,0,0,0,0]
[null,null,null,null,null,null,null,null,null,0,"",null,null,null,null,null,null,null,null,null,null,0,null,null,0,null,null,null,null,null,null,0,0,0,0,0,0,0,0,0,0,0,0,0,0,0,0,0,0]
[null,null,null,null,null,null,null,null,null,0,"",null,null,null,null,null,null,null,null,null,null,0,null,null,0,null,null,null,null,null,null,0,0,0,0,0,0,0,0,0,0,0,0,0,0,0,0,0,0]
[null,null,null,null,null,null,null,null,null,0,"",null,null,null,null,null,null,null,null,null,null,0,null,null,0,null,null,null,null,null,null,0,0,0,0,0,0,0,0,0,0,0,0,0,0,0,0,0,0]
[null,null,null,null,null,null,null,null,null,0,"",null,null,null,null,null,null,null,null,null,null,0,null,null,0,null,null,null,null,null,null,0,0,0,0,0,0,0,0,0,0,0,0,0,0,0,0,0,0]
[null,null,null,null,null,null,null,null,null,0,"",null,null,null,null,null,null,null,null,null,null,0,null,null,0,null,null,null,null,null,null,0,0,0,0,0,0,0,0,0,0,0,0,0,0,0,0,0,0]
[null,null,null,null,null,null,null,null,null,0,"",null,null,null,null,null,null,null,null,null,null,0,null,null,0,null,null,null,null,null,null,0,0,0,0,0,0,0,0,0,0,0,0,0,0,0,0,0,0]
[null,null,null,null,null,null,null,null,null,0,"",null,null,null,null,null,null,null,null,null,null,0,null,null,0,null,null,null,null,null,null,0,0,0,0,0,0,0,0,0,0,0,0,0,0,0,0,0,0]
[null,null,null,null,null,null,null,null,null,0,{"$f":"IF(C36<=0,\"\",IF(C36=C35,\"\",1))","v":""},null,null,null,null,null,null,null,null,null,null,0,null,null,0,null,null,null,null,null,null,0,0,0,0,0,0,0,0,0,0,0,0,0,0,0,0,0,0]
[null,null,null,null,null,null,null,null,null,0,"",null,null,null,null,null,null,null,null,null,null,0,null,null,0,null,null,null,null,null,null,0,0,0,0,0,0,0,0,0,0,0,0,0,0,0,0,0,0]
[null,null,null,null,null,null,null,null,null,0,"",null,null,null,null,null,null,null,null,null,null,0,null,null,0,null,null,null,null,null,null,0,0,0,0,0,0,0,0,0,0,0,0,0,0,0,0,0,0]
[null,null,null,null,null,null,null,null,null,0,"",null,null,null,null,null,null,null,null,null,null,0,null,null,0,null,null,null,null,null,null,0,0,0,0,0,0,0,0,0,0,0,0,0,0,0,0,0,0]
[null,null,null,null,null,null,null,null,null,0,"",null,null,null,null,null,null,null,null,null,null,0,null,null,0,null,null,null,null,null,null,0,0,0,0,0,0,0,0,0,0,0,0,0,0,0,0,0,0]
[null,null,null,null,null,null,null,null,null,0,"",null,null,null,null,null,null,null,null,null,null,0,null,null,0,null,null,null,null,null,null,0,0,0,0,0,0,0,0,0,0,0,0,0,0,0,0,0,0]
[null,null,null,null,null,null,null,null,null,0,"",null,null,null,null,null,null,null,null,null,null,0,null,null,0,null,null,null,null,null,null,0,0,0,0,0,0,0,0,0,0,0,0,0,0,0,0,0,0]
[null,null,null,null,null,null,null,null,null,0,"",null,null,null,null,null,null,null,null,null,null,0,null,null,0,null,null,null,null,null,null,0,0,0,0,0,0,0,0,0,0,0,0,0,0,0,0,0,0]
[null,null,null,null,null,null,null,null,null,0,"",null,null,null,null,null,null,null,null,null,null,0,null,null,0,null,null,null,null,null,null,0,0,0,0,0,0,0,0,0,0,0,0,0,0,0,0,0,0]
[null,null,null,null,null,null,null,null,null,0,"",null,null,null,null,null,null,null,null,null,null,0,null,null,0,null,null,null,null,null,null,0,0,0,0,0,0,0,0,0,0,0,0,0,0,0,0,0,0]
[null,null,null,null,null,null,null,null,null,0,"",null,null,null,null,null,null,null,null,null,null,0,null,null,0,null,null,null,null,null,null,0,0,0,0,0,0,0,0,0,0,0,0,0,0,0,0,0,0]
[null,null,null,null,null,null,null,null,null,0,"",null,null,null,null,null,null,null,null,null,null,0,null,null,0,null,null,null,null,null,null,0,0,0,0,0,0,0,0,0,0,0,0,0,0,0,0,0,0]
[null,null,null,null,null,null,null,null,null,0,"",null,null,null,null,null,null,null,null,null,null,0,null,null,0,null,null,null,null,null,null,0,0,0,0,0,0,0,0,0,0,0,0,0,0,0,0,0,0]
[null,null,null,null,null,null,null,null,null,0,"",null,null,null,null,null,null,null,null,null,null,0,null,null,0,null,null,null,null,null,null,0,0,0,0,0,0,0,0,0,0,0,0,0,0,0,0,0,0]
[null,null,null,null,null,null,null,null,null,0,"",null,null,null,null,null,null,null,null,null,null,0,null,null,0,null,null,null,null,null,null,0,0,0,0,0,0,0,0,0,0,0,0,0,0,0,0,0,0]
[null,null,null,null,null,null,null,null,null,0,"",null,null,null,null,null,null,null,null,null,null,0,null,null,0,null,null,null,null,null,null,0,0,0,0,0,0,0,0,0,0,0,0,0,0,0,0,0,0]
[null,null,null,null,null,null,null,null,null,0,"",null,null,null,null,null,null,null,null,null,null,0,null,null,0,null,null,null,null,null,null,0,0,0,0,0,0,0,0,0,0,0,0,0,0,0,0,0,0]
[null,null,null,null,null,null,null,null,null,0,"",null,null,null,null,null,null,null,null,null,null,0,null,null,0,null,null,null,null,null,null,0,0,0,0,0,0,0,0,0,0,0,0,0,0,0,0,0,0]
[null,null,null,null,null,null,null,null,null,0,"",null,null,null,null,null,null,null,null,null,null,0,null,null,0,null,null,null,null,null,null,0,0,0,0,0,0,0,0,0,0,0,0,0,0,0,0,0,0]
[null,null,null,null,null,null,null,null,null,0,"",null,null,null,null,null,null,null,null,null,null,0,null,null,0,null,null,null,null,null,null,0,0,0,0,0,0,0,0,0,0,0,0,0,0,0,0,0,0]
[null,null,null,null,null,null,null,null,null,0,"",null,null,null,null,null,null,null,null,null,null,0,null,null,0,null,null,null,null,null,null,0,0,0,0,0,0,0,0,0,0,0,0,0,0,0,0,0,0]
[null,null,null,null,null,null,null,null,null,0,"",null,null,null,null,null,null,null,null,null,null,0,null,null,0,null,null,null,null,null,null,0,0,0,0,0,0,0,0,0,0,0,0,0,0,0,0,0,0]
[null,null,null,null,null,null,null,null,null,0,"",null,null,null,null,null,null,null,null,null,null,0,null,null,0,null,null,null,null,null,null,0,0,0,0,0,0,0,0,0,0,0,0,0,0,0,0,0,0]
[null,null,null,null,null,null,null,null,null,0,"",null,null,null,null,null,null,null,null,null,null,0,null,null,0,null,null,null,null,null,null,0,0,0,0,0,0,0,0,0,0,0,0,0,0,0,0,0,0]
[null,null,null,null,null,null,null,null,null,0,"",null,null,null,null,null,null,null,null,null,null,0,null,null,0,null,null,null,null,null,null,0,0,0,0,0,0,0,0,0,0,0,0,0,0,0,0,0,0]
{"$rows_left_out":344}
{"sheet":"Reconciliation","index":1,"n_rows":10,"n_cols":34,"rows_kept":10,"cut":false,"hidden":true,"merged":[]}
["TCN","Procedure Code","REGION","Provider Name","Provider Number","RAC Code","Client Last Name","Client First Name","Client P1 Id","Service Month","Paid Units","Daily Rate","Paid Amt","Participation","Remittance","Remittance Paid Date","Schedule J Detail by Client Contracted Amount","Schedule J Detail by Client Contracted Days","Cost Variance","Days Variance","Sched J Rate","Sched J Days","Schedule J Total","Days Variance","Dollars Variance","Comments","Resource Manager Response","Resource Manager Comments","Action taken by Analyst"]
[null,null,null,null,null,null,null,null,null,null,null,null,null,null,null,null,{"$f":"SUMIF('Schedule H - Rate History'!$C$4:$C$397,I1,'Schedule H - Rate History'!$AU$4:$AU$397)","v":0},{"$f":"SUMIF('Schedule H - Rate History'!$C$4:$C$397,I1,'Schedule H - Rate History'!$AW$4:$AW$397)","v":0},{"$f":"(M2+N2)-Q2","v":0},{"$f":"K2-R2","v":0},null,null,{"$f":"U2*V2","v":0},{"$f":"K2-V2","v":0},{"$f":"M2+N2-W2","v":0},null,null,null,null,"SA716 & SA722","Supported Living & Group Home",{"$f":"SUBTOTAL(9,#REF!)","v":{"$error":"#REF!"}},null,{"$f":"SUBTOTAL(9,#REF!)","v":{"$error":"#REF!"}}]
[null,null,null,null,null,null,null,null,null,null,null,null,null,null,null,null,null,null,null,null,null,{"$f":"SUBTOTAL(9,V2)","v":0},{"$f":"SUBTOTAL(9,W2)","v":0},{"$f":"SUBTOTAL(9,X2)","v":0},{"$f":"SUBTOTAL(9,Y2)","v":0},null,null,null,null,"Provider1 Total",null,{"$f":"SUM(AF2:AF2)","v":{"$error":"#REF!"}},null,{"$f":"SUM(AH2:AH2)","v":{"$error":"#REF!"}}]
[]
[null,null,null,null,null,null,null,null,null,null,null,null,null,null,null,null,null,null,null,null,"Subtotal",null,null,{"$f":"SUBTOTAL(9,X2:X3)","v":0},{"$f":"SUBTOTAL(9,Y2:Y3)","v":0},null,null,null,null,"Less overpayments",null,0,null,0]
[null,null,null,null,null,null,null,null,null,null,null,null,null,null,null,null,null,null,null,null,null,null,null,null,null,null,null,null,null,"Add underpayments",null,0,null,0]
[null,null,null,null,null,null,null,null,null,null,null,null,null,null,null,null,null,null,null,null,null,null,null,null,null,null,null,null,null,"Adjusted Total",null,{"$f":"SUM(AF2:AF2,AF5,AF6)","v":{"$error":"#REF!"}},null,{"$f":"SUM(AH2:AH2,AH5,AH6)","v":{"$error":"#REF!"}}]
[]
[null,null,null,null,null,null,null,null,null,null,null,null,null,null,null,null,null,null,null,null,null,null,null,null,null,null,null,null,null,"Sched J Check",null,{"$f":"#REF!","v":{"$error":"#REF!"}},null,{"$f":"#REF!+#REF!","v":{"$error":"#REF!"}}]
[null,null,null,null,null,null,null,null,null,null,null,null,null,null,null,null,null,null,null,null,null,null,null,null,null,null,null,null,null,"Difference",null,{"$f":"AF7-AF9","v":{"$error":"#REF!"}},null,{"$f":"AH7-AH9","v":{"$error":"#REF!"}}]

{"sheet":"Other Codes","index":2,"n_rows":1,"n_cols":16,"rows_kept":1,"cut":false,"hidden":true,"merged":[]}
["TCN","Procedure Code","REGION","Provider Name","Provider Number","RAC Code","Client Last Name","Client First Name","Client P1 Id","Service Month","Paid Units","Daily Rate","Paid Amt","Participation","Remittance","Remittance Paid Date"]

{"sheet":"List","index":3,"n_rows":142,"n_cols":9,"rows_kept":142,"cut":false,"hidden":true,"merged":[]}
["Provider Name","Provider ID","Urban Designation",null,null,"Program Type","Service Code & RAC",null,"RM Responses"]
[]
["1N - Adult Guidance & Empowerment Service",111684901,"MSA",null,null,"SL Supported Living","SA716-3603 SL CORE",null,"Underpayment to be claimed"]
["1N - Alpha Supported Living (Spokane)",111320906,"MSA",null,null,"GH Group Home","SA716-3604 SL CP",null,"Underpayment will not be claimed, please adjust settlement"]
["1N - Ambitions - Spokane",111901906,"MSA",null,null,"GTH Group Training Home","SA716-3701 SL RCL",null,"Overpayment to be adjusted in P1"]
["1N - Ambitions - Wenatchee, Omak, Moses Lake",111901903,"MSA/NON-MSA",null,null,null,"SA716-3905 SL State",null,"Overpayment will not to be adjusted in P1 (explain why in column AE)"]
["1N - ARC of Spokane",111426502,"MSA",null,null,null,"SA722-3603 GH CORE",null,"COCA to be issued (Copy Attached)"]
["1N - Assisted Residential Services",111705601,"MSA",null,null,null,"SA722-3701 GH RCL",null,"COCA issued previously (Copy Attached)"]
["1N - Community Integrated Services",111425301,"MSA",null,null,null,"SA722-3905 GH State",null,"COCA not submitted by provider per DDA policy timelines"]
["1N - Community Visions",111530102,"MSA",null,null,null,"SA722-3603 GTH CORE"]
["1N - Dreamworks Residential",111913801,"NON-MSA",null,null,null,"SA722-3701 GTH RCL"]
["1N - Drive Services",111621401,"MSA",null,null,null,"SA722-3905 GTH State"]
["1N - Excel Supported Living",111322002,"MSA"]
["1N - Grace Support Services",212120601,"MSA"]
["1N - Grant County Developmental Disabilities (DCL)",200012501,"NON-MSA"]
["1N - Hope Human Services (Spokane)",207150604,"MSA"]
["1N - Hope Supported Living",213504001,"MSA"]
["1N - Kaler House",111686001,"MSA"]
["1N - L.M.K.",111988202,"NON-MSA"]
["1N - Latah Services",111762501,"MSA"]
["1N - Living In Fulfilling Environment",111777301,"MSA"]
["1N - Mission Vista",111707401,"MSA"]
["1N - Parent's Cooperative Society for the Handicapped (Merry Glen)",111328901,"MSA"]
["1N - ResCare Spokane",111968514,"MSA"]
["1S - Alternative Residential Services",111625401,"MSA/NON-MSA"]
["1S - Ambitions - Kennewick",111901901,"MSA"]
["1S - Ambitions - Yakima",111901907,"MSA"]
["1S - Community Living",111962202,"MSA"]
["1S - Deaf Access Washington",111321901,"MSA"]
["1S - Elmview",111604101,"MSA/NON-MSA"]
["1S - Habilitat",111449601,"NON-MSA"]
["1S - Kittitas Interactive Management",111688701,"NON-MSA"]
["1S - Kittitas Interactive Management (Yakima)",111688702,"MSA"]
["1S - Reach Supported Living",209862801,"MSA"]
["1S - Reach Supported Living Walla Walla",209862802,"MSA"]
["1S - Tri-Cities Residential Services",111872501,"MSA"]
["1S - Valley Residential Services",111777901,"NON-MSA"]
["2N - Aacres",111414307,"MSA"]
["2N - Access Living",111675101,"MSA"]
["2N - All Heart Agency",111961601,"MSA"]
["2N - Alpha Supported Living Services",111320902,"MSA"]
["2N - Ambitions Whatcom",111901908,"MSA"]
["2N - Camelot Society",101955202,"MSA"]
["2N - Cascade Connections",111724102,"MSA"]
["2N - Evergreen Supported Living",111690301,"MSA"]
["2N - Holly Community Services",111765001,"MSA"]
["2N - La Casa de Esperanza ",111390801,"MSA"]
["2N - Puffin Island",111959501,"MSA"]
["2N - Quilceda Community Services",111321203,"MSA"]
["2N - Rehabco",111681901,"MSA"]
["2N - Rescare",111968512,"MSA"]
["2N - Sails",111805705,"MSA"]
["2N - Service Alternatives for WA",111513304,"MSA"]
["2N - Snohomish Supportive Living Services",111518901,"MSA"]
["2N - Soundview Association",111830201,"MSA"]
["2N - Steps Toward Independence",112034301,"MSA"]
["2N - Sunrise Services",203434610,"MSA"]
["2N - Village Community Services",111938301,"MSA"]
["2N - Volunteers of America",200494106,"MSA"]
["2S - Alpha Supported Living Services",111320901,"KING"]
{"$rows_left_out":82}