{"text_format":"1","workbook":"xlsx","n_sheets":4,"sheets":["Schedule H Rate History","Reconciliation","Other Codes","List"],"not_rendered":{"charts":0,"images":0,"macros":0,"external_links":12,"defined_names":2696,"comments":1,"pivot_tables":0},"unopened":[],"bounds":{"document_bytes":16777216,"sheet_cells":100000,"rows_first":2000,"rows_last":500,"rows_between":2000,"halvings":0,"cell_chars":16384,"cell_head_chars":4096},"cells_cut":0,"cells_raw":0,"read":"whole","date_system":"1900"}

{"sheet":"Schedule H Rate History","index":0,"n_rows":383,"n_cols":38,"rows_kept":383,"cut":false,"hidden":false,"merged":[[1,0,1,2],[1,3,1,4],[1,5,1,8],[1,11,1,23],[0,0,0,2],[0,3,0,4],[0,5,0,6],[0,7,0,10],[0,11,0,37]]}
["Program Name",null,null,null,null,"Provider ID",null,{"$f":"VLOOKUP(D1,List!A2:C139,2)","v":{"$error":"#N/A"}},null,null,null,"FOR PROVIDER USE ONLY\nDO NOT SUBMIT WITH COST REPORT"]
["Report Period",null,null,"2021-01-01",null,"2021-12-31",null,null,null,{"$f":"IF($AD$1=\"\",SUM(J4:J378),SUMIF($E$4:$E$378,$AD$1,J4:J378))","v":0},{"$f":"IF($AD$1=\"\",SUM(K4:K378),SUMIF($E$4:$E$378,$AD$1,K4:K378))","v":0},"Annual Totals",null,null,null,null,null,null,null,null,null,null,null,null,{"$f":"IF($AD$1=\"\",SUM(Y4:Y378),SUMIF($E$4:$E$378,$AD$1,Y4:Y378))","v":0},{"$f":"IF($AD$1=\"\",SUM(Z4:Z378),SUMIF($E$4:$E$378,$AD$1,Z4:Z378))","v":0},{"$f":"IF($AD$1=\"\",SUM(AA4:AA378),SUMIF($E$4:$E$378,$AD$1,AA4:AA378))","v":0},{"$f":"IF($AD$1=\"\",SUM(AB4:AB378),SUMIF($E$4:$E$378,$AD$1,AB4:AB378))","v":0},{"$f":"IF($AD$1=\"\",SUM(AC4:AC378),SUMIF($E$4:$E$378,$AD$1,AC4:AC378))","v":0},{"$f":"IF($AD$1=\"\",SUM(AD4:AD378),SUMIF($E$4:$E$378,$AD$1,AD4:AD378))","v":0},{"$f":"IF($AD$1=\"\",SUM(AE4:AE378),SUMIF($E$4:$E$378,$AD$1,AE4:AE378))","v":0},{"$f":"IF($AD$1=\"\",SUM(AF4:AF378),SUMIF($E$4:$E$378,$AD$1,AF4:AF378))","v":0},{"$f":"IF($AD$1=\"\",SUM(AG4:AG378),SUMIF($E$4:$E$378,$AD$1,AG4:AG378))","v":0},{"$f":"IF($AD$1=\"\",SUM(AH4:AH378),SUMIF($E$4:$E$378,$AD$1,AH4:AH378))","v":0},{"$f":"IF($AD$1=\"\",SUM(AI4:AI378),SUMIF($E$4:$E$378,$AD$1,AI4:AI378))","v":0},{"$f":"IF($AD$1=\"\",SUM(AJ4:AJ378),SUMIF($E$4:$E$378,$AD$1,AJ4:AJ378))","v":0},{"$f":"IF($AD$1=\"\",SUM(AK4:AK378),SUMIF($E$4:$E$378,$AD$1,AK4:AK378))","v":0},{"$f":"IF($AD$1=\"\",SUM(AL4:AL378),SUMIF($E$4:$E$378,$AD$1,AL4:AL378))","v":0}]
["Client Name (b) ","COCA Recipient","Client P1 ID (c)","P1 Service Code/RAC (v)","Program Type","Rate Effective Date (d)","Actual Start Date Overrides Column F","Rate End Date","Actual End Date Overrides Column H","Resid Days Paid","Client Count","ISS Tier Level (e)","ISS Daily Tier Rate (f)","ISS Prof Svs Daily Rate (k)","ISS CRST Tier Rate (l)","Total ISS Daily Rate","Admin Tier Rate (n)","Temp Rate Adjust (o)","Admin CRST Tier Rate (p)","Admin Cert Rate (q)","Transport Rate (r)","Other Non-ISS Rates (s)","Total Non-ISS Daily Rate","Total ISS & Non-ISS Daily Rate","Annual ISS Paid","Annual ISS Prof Svs Paid","Annual ISS CRST Paid","Total Annual ISS Paid","Annual Admin Paid","Annual Temp Rate Adjust","Annual Admin CRST Paid","Annual Admin Cert Paid","Annual Transport Paid","Annual Other Non-ISS Paid","Total Annual Non-ISS Paid","Annual ISS & Non-ISS Paid","Annual ISS & Non-ISS Paid per Client","Annual Days Paid per Client"]
[null,null,null,null,null,null,null,null,null,{"$f":"IF(F4>0,+IF(I4>0,I4,H4)-IF(G4>0,G4,F4)+1,0)","v":0},{"$f":"IF(C4<=0,\"\",IF(C4=C3,\"\",1))","v":""},null,null,null,null,{"$f":"SUM(M4:O4)","v":0},null,null,null,null,null,null,{"$f":"SUM(Q4:V4)","v":0},{"$f":"+P4+W4","v":0},{"$f":"M4*J4","v":0},{"$f":"J4*N4","v":0},{"$f":"O4*J4","v":0},{"$f":"$J4*P4","v":0},0,0,0,0,0,0,0,{"$f":"AB4+AI4","v":0},{"$f":"IF(A5=A4,0,SUMIF($A$4:$A$4724,$A4,AB$4:AB$4724))+IF(A5=A4,0,SUMIF($A$4:$A$4724,$A4,AI$4:AI$4724))","v":0},{"$f":"IF(A5=A4,0,SUMIF($A$4:$A$4724,$A4,J$4:J$4724))+IF(A5=A4,0,SUMIF($A$4:$A$4724,$A4))","v":0}]
[null,null,null,null,null,null,null,null,null,{"$f":"IF(F5>0,+IF(I5>0,I5,H5)-IF(G5>0,G5,F5)+1,0)","v":0},{"$f":"IF(C5<=0,\"\",IF(C5=C4,\"\",1))","v":""},null,null,null,null,0,null,null,null,null,null,null,{"$f":"SUM(Q5:V5)","v":0},{"$f":"+P5+W5","v":0},{"$f":"M5*J5","v":0},{"$f":"J5*N5","v":0},{"$f":"O5*J5","v":0},{"$f":"$J5*P5","v":0},{"$f":"$J5*Q5","v":0},{"$f":"$J5*R5","v":0},{"$f":"$J5*S5","v":0},{"$f":"$J5*T5","v":0},{"$f":"$J5*U5","v":0},{"$f":"$J5*V5","v":0},{"$f":"$J5*W5","v":0},{"$f":"AB5+AI5","v":0},{"$f":"IF(A6=A5,0,SUMIF($A$4:$A$4724,$A5,AB$4:AB$4724))+IF(A6=A5,0,SUMIF($A$4:$A$4724,$A5,AI$4:AI$4724))","v":0},{"$f":"IF(A6=A5,0,SUMIF($A$4:$A$4724,$A5,J$4:J$4724))+IF(A6=A5,0,SUMIF($A$4:$A$4724,$A5))","v":0}]
[null,null,null,null,null,null,null,null,null,0,"",null,null,null,null,0,null,null,null,null,null,null,0,0,0,0,0,0,0,0,0,0,0,0,0,0,0,0]
[null,null,null,null,null,null,null,null,null,0,"",null,null,null,null,0,null,null,null,null,null,null,0,0,0,0,0,0,0,0,0,0,0,0,0,0,0,0]
[null,null,null,null,null,null,null,null,null,0,"",null,null,null,null,0,null,null,null,null,null,null,0,0,0,0,0,0,0,0,0,0,0,0,0,0,0,0]
[null,null,null,null,null,null,null,null,null,0,"",null,null,null,null,0,null,null,null,null,null,null,0,0,0,0,0,0,0,0,0,0,0,0,0,0,0,0]
[null,null,null,null,null,null,null,null,null,0,"",null,null,null,null,0,null,null,null,null,null,null,0,0,0,0,0,0,0,0,0,0,0,0,0,0,0,0]
[null,null,null,null,null,null,null,null,null,0,"",null,null,null,null,0,null,null,null,null,null,null,0,0,0,0,0,0,0,0,0,0,0,0,0,0,0,0]
[null,null,null,null,null,null,null,null,null,0,"",null,null,null,null,0,null,null,null,null,null,null,0,0,0,0,0,0,0,0,0,0,0,0,0,0,0,0]
[null,null,null,null,null,null,null,null,null,0,"",null,null,null,null,0,null,null,null,null,null,null,0,0,0,0,0,0,0,0,0,0,0,0,0,0,0,0]
[null,null,null,null,null,null,null,null,null,0,"",null,null,null,null,0,null,null,null,null,null,null,0,0,0,0,0,0,0,0,0,0,0,0,0,0,0,0]
[null,null,null,null,null,null,null,null,null,0,"",null,null,null,null,0,null,null,null,null,null,null,0,0,0,0,0,0,0,0,0,0,0,0,0,0,0,0]
[null,null,null,null,null,null,null,null,null,0,"",null,null,null,null,0,null,null,null,null,null,null,0,0,0,0,0,0,0,0,0,0,0,0,0,0,0,0]
[null,null,null,null,null,null,null,null,null,0,"",null,null,null,null,0,null,null,null,null,null,null,0,0,0,0,0,0,0,0,0,0,0,0,0,0,0,0]
[null,null,null,null,null,null,null,null,null,0,"",null,null,null,null,0,null,null,null,null,null,null,0,0,0,0,0,0,0,0,0,0,0,0,0,0,0,0]
[null,null,null,null,null,null,null,null,null,0,"",null,null,null,null,0,null,null,null,null,null,null,0,0,0,0,0,0,0,0,0,0,0,0,0,0,0,0]
[null,null,null,null,null,null,null,null,null,0,"",null,null,null,null,0,null,null,null,null,null,null,0,0,0,0,0,0,0,0,0,0,0,0,0,0,0,0]
[null,null,null,null,null,null,null,null,null,0,"",null,null,null,null,0,null,null,null,null,null,null,0,0,0,0,0,0,0,0,0,0,0,0,0,0,0,0]
[null,null,null,null,null,null,null,null,null,0,"",null,null,null,null,0,null,null,null,null,null,null,0,0,0,0,0,0,0,0,0,0,0,0,0,0,0,0]
[null,null,null,null,null,null,null,null,null,0,"",null,null,null,null,0,null,null,null,null,null,null,0,0,0,0,0,0,0,0,0,0,0,0,0,0,0,0]
[null,null,null,null,null,null,null,null,null,0,"",null,null,null,null,0,null,null,null,null,null,null,0,0,0,0,0,0,0,0,0,0,0,0,0,0,0,0]
[null,null,null,null,null,null,null,null,null,0,"",null,null,null,null,0,null,null,null,null,null,null,0,0,0,0,0,0,0,0,0,0,0,0,0,0,0,0]
[null,null,null,null,null,null,null,null,null,0,"",null,null,null,null,0,null,null,null,null,null,null,0,0,0,0,0,0,0,0,0,0,0,0,0,0,0,0]
[null,null,null,null,null,null,null,null,null,0,"",null,null,null,null,0,null,null,null,null,null,null,0,0,0,0,0,0,0,0,0,0,0,0,0,0,0,0]
[null,null,null,null,null,null,null,null,null,0,"",null,null,null,null,0,null,null,null,null,null,null,0,0,0,0,0,0,0,0,0,0,0,0,0,0,0,0]
[null,null,null,null,null,null,null,null,null,0,"",null,null,null,null,0,null,null,null,null,null,null,0,0,0,0,0,0,0,0,0,0,0,0,0,0,0,0]
[null,null,null,null,null,null,null,null,null,0,"",null,null,null,null,0,null,null,null,null,null,null,0,0,0,0,0,0,0,0,0,0,0,0,0,0,0,0]
[null,null,null,null,null,null,null,null,null,0,"",null,null,null,null,0,null,null,null,null,null,null,0,0,0,0,0,0,0,0,0,0,0,0,0,0,0,0]
[null,null,null,null,null,null,null,null,null,0,"",null,null,null,null,0,null,null,null,null,null,null,0,0,0,0,0,0,0,0,0,0,0,0,0,0,0,0]
[null,null,null,null,null,null,null,null,null,0,"",null,null,null,null,0,null,null,null,null,null,null,0,0,0,0,0,0,0,0,0,0,0,0,0,0,0,0]
[null,null,null,null,null,null,null,null,null,0,"",null,null,null,null,0,null,null,null,null,null,null,0,0,0,0,0,0,0,0,0,0,0,0,0,0,0,0]
[null,null,null,null,null,null,null,null,null,0,"",null,null,null,null,0,null,null,null,null,null,null,0,0,0,0,0,0,0,0,0,0,0,0,0,0,0,0]
[null,null,null,null,null,null,null,null,null,0,"",null,null,null,null,0,null,null,null,null,null,null,0,0,0,0,0,0,0,0,0,0,0,0,0,0,0,0]
[null,null,null,null,null,null,null,null,null,0,"",null,null,null,null,0,null,null,null,null,null,null,0,0,0,0,0,0,0,0,0,0,0,0,0,0,0,0]
[null,null,null,null,null,null,null,null,null,0,"",null,null,null,null,0,null,null,null,null,null,null,0,0,0,0,0,0,0,0,0,0,0,0,0,0,0,0]
[null,null,null,null,null,null,null,null,null,0,"",null,null,null,null,0,null,null,null,null,null,null,0,0,0,0,0,0,0,0,0,0,0,0,0,0,0,0]
[null,null,null,null,null,null,null,null,null,0,"",null,null,null,null,0,null,null,null,null,null,null,0,0,0,0,0,0,0,0,0,0,0,0,0,0,0,0]
[null,null,null,null,null,null,null,null,null,0,"",null,null,null,null,0,null,null,null,null,null,null,0,0,0,0,0,0,0,0,0,0,0,0,0,0,0,0]
[null,null,null,null,null,null,null,null,null,0,"",null,null,null,null,0,null,null,null,null,null,null,0,0,0,0,0,0,0,0,0,0,0,0,0,0,0,0]
[null,null,null,null,null,null,null,null,null,0,"",null,null,null,null,0,null,null,null,null,null,null,0,0,0,0,0,0,0,0,0,0,0,0,0,0,0,0]
[null,null,null,null,null,null,null,null,null,0,"",null,null,null,null,0,null,null,null,null,null,null,0,0,0,0,0,0,0,0,0,0,0,0,0,0,0,0]
[null,null,null,null,null,null,null,null,null,0,"",null,null,null,null,0,null,null,null,null,null,null,0,0,0,0,0,0,0,0,0,0,0,0,0,0,0,0]
[null,null,null,null,null,null,null,null,null,0,"",null,null,null,null,0,null,null,null,null,null,null,0,0,0,0,0,0,0,0,0,0,0,0,0,0,0,0]
[null,null,null,null,null,null,null,null,null,0,"",null,null,null,null,0,null,null,null,null,null,null,0,0,0,0,0,0,0,0,0,0,0,0,0,0,0,0]
[null,null,null,null,null,null,null,null,null,0,"",null,null,null,null,0,null,null,null,null,null,null,0,0,0,0,0,0,0,0,0,0,0,0,0,0,0,0]
[null,null,null,null,null,null,null,null,null,0,"",null,null,null,null,0,null,null,null,null,null,null,0,0,0,0,0,0,0,0,0,0,0,0,0,0,0,0]
[null,null,null,null,null,null,null,null,null,0,"",null,null,null,null,0,null,null,null,null,null,null,0,0,0,0,0,0,0,0,0,0,0,0,0,0,0,0]
[null,null,null,null,null,null,null,null,null,0,"",null,null,null,null,0,null,null,null,null,null,null,0,0,0,0,0,0,0,0,0,0,0,0,0,0,0,0]
[null,null,null,null,null,null,null,null,null,0,"",null,null,null,null,0,null,null,null,null,null,null,0,0,0,0,0,0,0,0,0,0,0,0,0,0,0,0]
[null,null,null,null,null,null,null,null,null,0,"",null,null,null,null,0,null,null,null,null,null,null,0,0,0,0,0,0,0,0,0,0,0,0,0,0,0,0]
[null,null,null,null,null,null,null,null,null,0,"",null,null,null,null,0,null,null,null,null,null,null,0,0,0,0,0,0,0,0,0,0,0,0,0,0,0,0]
[null,null,null,null,null,null,null,null,null,0,"",null,null,null,null,0,null,null,null,null,null,null,0,0,0,0,0,0,0,0,0,0,0,0,0,0,0,0]
[null,null,null,null,null,null,null,null,null,0,"",null,null,null,null,0,null,null,null,null,null,null,0,0,0,0,0,0,0,0,0,0,0,0,0,0,0,0]
[null,null,null,null,null,null,null,null,null,0,"",null,null,null,null,0,null,null,null,null,null,null,0,0,0,0,0,0,0,0,0,0,0,0,0,0,0,0]
[null,null,null,null,null,null,null,null,null,0,"",null,null,null,null,0,null,null,null,null,null,null,0,0,0,0,0,0,0,0,0,0,0,0,0,0,0,0]
[null,null,null,null,null,null,null,null,null,0,"",null,null,null,null,0,null,null,null,null,null,null,0,0,0,0,0,0,0,0,0,0,0,0,0,0,0,0]
[null,null,null,null,null,null,null,null,null,0,"",null,null,null,null,0,null,null,null,null,null,null,0,0,0,0,0,0,0,0,0,0,0,0,0,0,0,0]
[null,null,null,null,null,null,null,null,null,0,"",null,null,null,null,0,null,null,null,null,null,null,0,0,0,0,0,0,0,0,0,0,0,0,0,0,0,0]
[null,null,null,null,null,null,null,null,null,0,"",null,null,null,null,0,null,null,null,null,null,null,0,0,0,0,0,0,0,0,0,0,0,0,0,0,0,0]
[null,null,null,null,null,null,null,null,null,0,"",null,null,null,null,0,null,null,null,null,null,null,0,0,0,0,0,0,0,0,0,0,0,0,0,0,0,0]
[null,null,null,null,null,null,null,null,null,0,"",null,null,null,null,0,null,null,null,null,null,null,0,0,0,0,0,0,0,0,0,0,0,0,0,0,0,0]
[null,null,null,null,null,null,null,null,null,0,"",null,null,null,null,0,null,null,null,null,null,null,0,0,0,0,0,0,0,0,0,0,0,0,0,0,0,0]
[null,null,null,null,null,null,null,null,null,0,"",null,null,null,null,0,null,null,null,null,null,null,0,0,0,0,0,0,0,0,0,0,0,0,0,0,0,0]
[null,null,null,null,null,null,null,null,null,0,"",null,null,null,null,0,null,null,null,null,null,null,0,0,0,0,0,0,0,0,0,0,0,0,0,0,0,0]
[null,null,null,null,null,null,null,null,null,0,"",null,null,null,null,{"$f":"SUM(M68:O68)","v":0},null,null,null,null,null,null,0,0,0,0,0,0,0,0,0,0,0,0,0,0,0,0]
[null,null,null,null,null,null,null,null,null,{"$f":"IF(F69>0,+IF(I69>0,I69,H69)-IF(G69>0,G69,F69)+1,0)","v":0},{"$f":"IF(C69<=0,\"\",IF(C69=C68,\"\",1))","v":""},null,null,null,null,0,null,null,null,null,null,null,{"$f":"SUM(Q69:V69)","v":0},{"$f":"+P69+W69","v":0},{"$f":"M69*J69","v":0},{"$f":"J69*N69","v":0},{"$f":"O69*J69","v":0},{"$f":"$J69*P69","v":0},{"$f":"$J69*Q69","v":0},{"$f":"$J69*R69","v":0},{"$f":"$J69*S69","v":0},{"$f":"$J69*T69","v":0},{"$f":"$J69*U69","v":0},{"$f":"$J69*V69","v":0},{"$f":"$J69*W69","v":0},{"$f":"AB69+AI69","v":0},{"$f":"IF(A70=A69,0,SUMIF($A$4:$A$4724,$A69,AB$4:AB$4724))+IF(A70=A69,0,SUMIF($A$4:$A$4724,$A69,AI$4:AI$4724))","v":0},{"$f":"IF(A70=A69,0,SUMIF($A$4:$A$4724,$A69,J$4:J$4724))+IF(A70=A69,0,SUMIF($A$4:$A$4724,$A69))","v":0}]
[null,null,null,null,null,null,null,null,null,0,"",null,null,null,null,0,null,null,null,null,null,null,0,0,0,0,0,0,0,0,0,0,0,0,0,0,0,0]
[null,null,null,null,null,null,null,null,null,0,"",null,null,null,null,0,null,null,null,null,null,null,0,0,0,0,0,0,0,0,0,0,0,0,0,0,0,0]
[null,null,null,null,null,null,null,null,null,0,"",null,null,null,null,0,null,null,null,null,null,null,0,0,0,0,0,0,0,0,0,0,0,0,0,0,0,0]
[null,null,null,null,null,null,null,null,null,0,"",null,null,null,null,0,null,null,null,null,null,null,0,0,0,0,0,0,0,0,0,0,0,0,0,0,0,0]
[null,null,null,null,null,null,null,null,null,0,"",null,null,null,null,0,null,null,null,null,null,null,0,0,0,0,0,0,0,0,0,0,0,0,0,0,0,0]
[null,null,null,null,null,null,null,null,null,0,"",null,null,null,null,0,null,null,null,null,null,null,0,0,0,0,0,0,0,0,0,0,0,0,0,0,0,0]
[null,null,null,null,null,null,null,null,null,0,"",null,null,null,null,0,null,null,null,null,null,null,0,0,0,0,0,0,0,0,0,0,0,0,0,0,0,0]
[null,null,null,null,null,null,null,null,null,0,"",null,null,null,null,0,null,null,null,null,null,null,0,0,0,0,0,0,0,0,0,0,0,0,0,0,0,0]
[null,null,null,null,null,null,null,null,null,0,"",null,null,null,null,0,null,null,null,null,null,null,0,0,0,0,0,0,0,0,0,0,0,0,0,0,0,0]
[null,null,null,null,null,null,null,null,null,0,"",null,null,null,null,0,null,null,null,null,null,null,0,0,0,0,0,0,0,0,0,0,0,0,0,0,0,0]
[null,null,null,null,null,null,null,null,null,0,"",null,null,null,null,0,null,null,null,null,null,null,0,0,0,0,0,0,0,0,0,0,0,0,0,0,0,0]
{"$rows_left_out":304}
{"sheet":"Reconciliation","index":1,"n_rows":10,"n_cols":34,"rows_kept":10,"cut":false,"hidden":true,"merged":[]}
["TCN","Procedure Code","REGION","Provider Name","Provider Number","RAC Code","Client Last Name","Client First Name","Client P1 Id","Service Month","Paid Units","Daily Rate","Paid Amt","Participation","Remittance","Remittance Paid Date","Schedule J Detail by Client Contracted Amount","Schedule J Detail by Client Contracted Days","Cost Variance","Days Variance","Sched J Rate","Sched J Days","Schedule J Total","Days Variance","Dollars Variance","Comments","Resource Manager Response","Resource Manager Comments","Action taken by Analyst"]
[null,null,null,null,null,null,null,null,null,null,null,null,null,null,null,null,{"$f":"SUMIF('Schedule H Rate History'!$C$4:$C$378,I2,'Schedule H Rate History'!$AK$4:$AK$378)","v":0},{"$f":"SUMIF('Schedule H Rate History'!$C$4:$C$378,I2,'Schedule H Rate History'!$AL$4:$AL$378)","v":0},{"$f":"(M2+N2)-Q2","v":0},{"$f":"K2-R2","v":0},null,null,{"$f":"U2*V2","v":0},{"$f":"K2-V2","v":0},{"$f":"M2+N2-W2","v":0},null,null,null,null,"SA716 & SA722","Supported Living & Group Home",{"$f":"SUBTOTAL(9,#REF!)","v":{"$error":"#REF!"}},null,{"$f":"SUBTOTAL(9,#REF!)","v":{"$error":"#REF!"}}]
[null,null,null,null,null,null,null,null,null,null,null,null,null,null,null,null,null,null,null,null,null,{"$f":"SUBTOTAL(9,V2)","v":0},{"$f":"SUBTOTAL(9,W2)","v":0},{"$f":"SUBTOTAL(9,X2)","v":0},{"$f":"SUBTOTAL(9,Y2)","v":0},null,null,null,null,"Provider1 Total",null,{"$f":"SUM(AF2:AF2)","v":{"$error":"#REF!"}},null,{"$f":"SUM(AH2:AH2)","v":{"$error":"#REF!"}}]
[]
[null,null,null,null,null,null,null,null,null,null,null,null,null,null,null,null,null,null,null,null,"Subtotal",null,null,{"$f":"SUBTOTAL(9,X2:X3)","v":0},{"$f":"SUBTOTAL(9,Y2:Y3)","v":0},null,null,null,null,"Less overpayments",null,0,null,0]
[null,null,null,null,null,null,null,null,null,null,null,null,null,null,null,null,null,null,null,null,null,null,null,null,null,null,null,null,null,"Add underpayments",null,0,null,0]
[null,null,null,null,null,null,null,null,null,null,null,null,null,null,null,null,null,null,null,null,null,null,null,null,null,null,null,null,null,"Adjusted Total",null,{"$f":"SUM(AF2:AF2,AF5,AF6)","v":{"$error":"#REF!"}},null,{"$f":"SUM(AH2:AH2,AH5,AH6)","v":{"$error":"#REF!"}}]
[]
[null,null,null,null,null,null,null,null,null,null,null,null,null,null,null,null,null,null,null,null,null,null,null,null,null,null,null,null,null,"Sched J Check",null,{"$f":"#REF!","v":{"$error":"#REF!"}},null,{"$f":"#REF!+#REF!","v":{"$error":"#REF!"}}]
[null,null,null,null,null,null,null,null,null,null,null,null,null,null,null,null,null,null,null,null,null,null,null,null,null,null,null,null,null,"Difference",null,{"$f":"AF7-AF9","v":{"$error":"#REF!"}},null,{"$f":"AH7-AH9","v":{"$error":"#REF!"}}]

{"sheet":"Other Codes","index":2,"n_rows":1,"n_cols":16,"rows_kept":1,"cut":false,"hidden":true,"merged":[]}
["TCN","Procedure Code","REGION","Provider Name","Provider Number","RAC Code","Client Last Name","Client First Name","Client P1 Id","Service Month","Paid Units","Daily Rate","Paid Amt","Participation","Remittance","Remittance Paid Date"]

{"sheet":"List","index":3,"n_rows":139,"n_cols":9,"rows_kept":139,"cut":false,"hidden":true,"merged":[]}
["Provider Name","Provider ID","Urban Designation",null,"Program Type",null,"Service Code & RAC",null,"RM Responses"]
[]
["1N - Accendo of Washington",215573301,"MSA",null,"SL Supported Living",null,"SA716-3603 SL CORE",null,"Underpayment to be claimed"]
["1N - Adult Guidance & Empowerment Service",111684901,"MSA",null,"GH Group Home",null,"SA716-3604 SL CP",null,"Underpayment will not be claimed, please adjust settlement"]
["1N - Alpha Supported Living (Spokane)",111320906,"MSA",null,"GTH Group Training Home",null,"SA716-3701 SL RCL",null,"Overpayment to be adjusted in P1"]
["1N - Ambitions - Spokane",111901906,"MSA",null,null,null,"SA716-3905 SL State",null,"Overpayment will not to be adjusted in P1 (explain why in column AE)"]
["1N - Ambitions - Wenatchee, Omak, Moses Lake",111901903,"MSA/NON-MSA",null,null,null,"SA722-3603 GH CORE",null,"COCA to be issued (Copy Attached)"]
["1N - ARC of Spokane",111426502,"MSA",null,null,null,"SA722-3701 GH RCL",null,"COCA issued previously (Copy Attached)"]
["1N - Assisted Residential Services",111705601,"MSA",null,null,null,"SA722-3905 GH State",null,"COCA not submitted by provider per DDA policy timelines"]
["1N - Community Integrated Services",111425301,"MSA",null,null,null,"SA722-3603 GTH CORE"]
["1N - Community Visions",111530102,"MSA",null,null,null,"SA722-3701 GTH RCL"]
["1N - Dreamworks Residential",111913801,"NON-MSA",null,null,null,"SA722-3905 GTH State"]
["1N - Drive Services",111621401,"MSA"]
["1N - Excel Supported Living",111322002,"MSA"]
["1N - Grace Support Services",212120601,"MSA"]
["1N - Grant County Developmental Disabilities (DCL)",200012501,"NON-MSA"]
["1N - Hope Human Services (Spokane)",207150604,"MSA"]
["1N - Hope Supported Living",213504001,"MSA"]
["1N - Kaler House",111686001,"MSA"]
["1N - L.M.K.",111988202,"NON-MSA"]
["1N - Latah Services",111762501,"MSA"]
["1N - Living In Fulfilling Environment",111777301,"MSA"]
["1N - Mission Vista",111707401,"MSA"]
["1N - Parent's Cooperative Society for the Handicapped (Merry Glen)",111328901,"MSA"]
["1N - ResCare Spokane",111968514,"MSA"]
["1N - Sails Spokane",111805707,"MSA"]
["1S - Alternative Residential Services",111625401,"MSA/NON-MSA"]
["1S - Ambitions - Kennewick",111901901,"MSA"]
["1S - Ambitions - Yakima",111901907,"MSA"]
["1S - Community Living",111962202,"MSA"]
["1S - Elmview",111604101,"MSA/NON-MSA"]
["1S - Habilitat",111449601,"NON-MSA"]
["1S - Kittitas Interactive Management",111688701,"NON-MSA"]
["1S - Kittitas Interactive Management (Yakima)",111688702,"MSA"]
["1S - Reach Supported Living",209862801,"MSA"]
["1S - Reach Supported Living Walla Walla",209862802,"MSA"]
["1S - Reach Supported Living Yakima",209862803,"MSA"]
["1S - Tri-Cities Residential Services",111872501,"MSA"]
["1S - Valley Residential Services",111777901,"NON-MSA"]
["2N - Aacres",111414307,"MSA"]
["2N - Access Living",111675101,"MSA"]
["2N - All Heart Agency",111961601,"MSA"]
["2N - Alpha Supported Living Services",111320902,"MSA"]
["2N - Ambitions Whatcom",111901908,"MSA"]
["2N - Camelot Society",101955202,"MSA"]
["2N - Cascade Connections",111724102,"MSA"]
["2N - Evergreen Supported Living",111690301,"MSA"]
["2N - Holly Community Services",111765001,"MSA"]
["2N - La Casa de Esperanza ",111390801,"MSA"]
["2N - Puffin Island",111959501,"MSA"]
["2N - Quilceda Community Services",111321203,"MSA"]
["2N - Rehabco",111681901,"MSA"]
["2N - Rescare",111968512,"MSA"]
["2N - Sails",111805705,"MSA"]
["2N - Service Alternatives for WA",111513304,"MSA"]
["2N - Snohomish Supportive Living Services",111518901,"MSA"]
["2N - Soundview Association",111830201,"MSA"]
["2N - Steps Toward Independence",112034301,"MSA"]
["2N - Sunrise Services",203434610,"MSA"]
["2N - Village Community Services",111938301,"MSA"]
["2N - Volunteers of America",200494106,"MSA"]
["2S - Alpha Supported Living Services",111320901,"KING"]
["2S - Ambitions",111901902,"KING"]
["2S - Angeline House",111798601,"KING"]
["2S - Arc of King County",112013701,"KING"]
["2S - Banchero Friends Services",111415001,"KING"]
["2S - Bethesda Lutheran Communities",111621301,"KING"]
["2S - Camelot Society",101955201,"KING"]
["2S - Cascade Community Services",111875001,"KING"]
["2S - Citizen Access Residential Resources",111533401,"KING"]
["2S - Community Integrated Services",111425302,"KING"]
["2S - Community Living",111962201,"KING"]
["2S - Destiny House Operations",111992801,"KING"]
["2S - Friendship House",111405501,"KING"]
["2S - Greenwood Home",111913301,"KING"]
["2S - Habilitation Services",208173701,"KING"]
["2S - Helping Hands DBA Dahlia",111736003,"KING"]
["2S - Inglewood Residential and Community Services",111568401,"KING"]
["2S - Integrated Living Services",111789002,"KING"]
["2S - L'Arche Noah Sealth of Seattle",111798601,"KING"]
{"$rows_left_out":59}