{"text_format":"1","workbook":"xlsx","n_sheets":7,"sheets":["2025 JAN","Exhibit","2025 JUN","COCA","YE Schedule H Rate History","2026 JAN","List"],"not_rendered":{"charts":0,"images":1,"macros":0,"external_links":11,"defined_names":12013,"comments":4,"pivot_tables":0},"unopened":[],"bounds":{"document_bytes":16777216,"sheet_cells":100000,"rows_first":2000,"rows_last":500,"rows_between":2000,"halvings":0,"cell_chars":16384,"cell_head_chars":4096},"cells_cut":0,"cells_raw":0,"read":"whole","date_system":"1900"}

{"sheet":"2025 JAN","index":0,"n_rows":32,"n_cols":38,"rows_kept":32,"cut":false,"hidden":false,"merged":[[1,0,1,2],[1,3,1,4],[1,5,1,8],[1,11,1,23],[0,0,0,2],[0,3,0,4],[0,5,0,6],[0,7,0,10],[0,11,0,37]]}
["Program Name",null,null,"3S - ABC Residential Services",null,"Provider ID",null,{"$f":"VLOOKUP(D1,List!A2:C141,2)","v":555777999},null,null,null,"FOR PROVIDER USE ONLY\nDO NOT SUBMIT WITH COST REPORT"]
["Report Period",null,null,"2025-01-01",null,"2025-12-31",null,null,null,{"$f":"IF($AD$1=\"\",SUM(J4:J27),SUMIF($E$4:$E$27,$AD$1,J4:J27))","v":5110},{"$f":"IF($AD$1=\"\",SUM(K4:K27),SUMIF($E$4:$E$27,$AD$1,K4:K27))","v":14},"Annual Totals",null,null,null,null,null,null,null,null,null,null,null,null,{"$f":"IF($AD$1=\"\",SUM(Y4:Y27),SUMIF($E$4:$E$27,$AD$1,Y4:Y27))","v":1130784.6000000001},9603.15,21027.650000000005,1161415.4000000001,220492.84999999998,0,5270.6,12775,7475.2,16319.15,262332.80000000005,1423748.2000000002,1423748.2000000002,5110]
["Client Name (b) ","COCA Recipient","Client P1 ID (c)","P1 Service Code/RAC (v)","Program Type","Rate Effective Date (d)","Actual Start Date Overrides Column F","Rate End Date","Actual End Date Overrides Column H","Resid Days Paid","Client Count","ISS Tier Level (e)","ISS Tier Rate (f)","ISS Prof Svs Rate (k)","ISS CRST Tier Rate (l)","Total ISS Daily Rate","Admin Tier Rate (n)","Temp Rate Adjust (o)","Admin CRST Tier Rate (p)","Admin Cert Rate (q)","Transport Rate (r)","Other Non-ISS Rates (s)","Total Non-ISS Daily Rate","Total ISS & Non-ISS Daily Rate","Annual ISS Paid","Annual ISS Prof Svs Paid","Annual ISS CRST Paid","Total Annual ISS Paid","Annual Admin Paid","Annual Temp Rate Adjust","Annual Admin CRST Paid","Annual Admin Cert Paid","Annual Transport Paid","Annual Other Non-ISS Paid","Total Annual Non-ISS Paid","Annual ISS & Non-ISS Paid","Annual ISS & Non-ISS Paid per Client","Annual Days Paid per Client"]
["Client A",null,500,"SA722-3603 GH CORE","GH Group Home","2025-01-01",null,"2025-12-31",null,{"$f":"IF(F4>0,+IF(I4>0,I4,H4)-IF(G4>0,G4,F4)+1,0)","v":365},{"$f":"IF(C4<=0,\"\",IF(C4=C3,\"\",1))","v":1},4,291.70999999999998,0,5.42,{"$f":"SUM(M4:O4)","v":297.13},57.97,0,1.36,2.5,0,0,{"$f":"SUM(Q4:V4)","v":61.83},{"$f":"+P4+W4","v":358.96},{"$f":"M4*J4","v":106474.15},{"$f":"J4*N4","v":0},{"$f":"O4*J4","v":1978.3},{"$f":"$J4*P4","v":108452.45},21159.05,0,496.40000000000003,912.5,0,0,22567.95,{"$f":"AB4+AI4","v":131020.4},{"$f":"IF(A5=A4,0,SUMIF($A$4:$A$4789,$A4,AB$4:AB$4789))+IF(A5=A4,0,SUMIF($A$4:$A$4789,$A4,AI$4:AI$4789))","v":131020.4},{"$f":"IF(A5=A4,0,SUMIF($A$4:$A$4789,$A4,J$4:J$4789))+IF(A5=A4,0,SUMIF($A$4:$A$4789,$A4))","v":365}]
["Client B",null,502,"SA722-3603 GH CORE","GH Group Home","2025-01-01",null,"2025-12-31",null,{"$f":"IF(F5>0,+IF(I5>0,I5,H5)-IF(G5>0,G5,F5)+1,0)","v":365},{"$f":"IF(C5<=0,\"\",IF(C5=C4,\"\",1))","v":1},3,223.56,0,4.16,{"$f":"SUM(M5:O5)","v":227.72},56.63,0,1.04,2.5,0,0,{"$f":"SUM(Q5:V5)","v":60.17},{"$f":"+P5+W5","v":287.89},{"$f":"M5*J5","v":81599.399999999994},{"$f":"J5*N5","v":0},{"$f":"O5*J5","v":1518.4},{"$f":"$J5*P5","v":83117.8},{"$f":"$J5*Q5","v":20669.95},{"$f":"$J5*R5","v":0},{"$f":"$J5*S5","v":379.6},{"$f":"$J5*T5","v":912.5},{"$f":"$J5*U5","v":0},{"$f":"$J5*V5","v":0},{"$f":"$J5*W5","v":21962.05},{"$f":"AB5+AI5","v":105079.85},{"$f":"IF(A6=A5,0,SUMIF($A$4:$A$4789,$A5,AB$4:AB$4789))+IF(A6=A5,0,SUMIF($A$4:$A$4789,$A5,AI$4:AI$4789))","v":105079.85},{"$f":"IF(A6=A5,0,SUMIF($A$4:$A$4789,$A5,J$4:J$4789))+IF(A6=A5,0,SUMIF($A$4:$A$4789,$A5))","v":365}]
["Client C",null,503,"SA722-3603 GH CORE","GH Group Home","2025-01-01",null,"2025-12-31",null,365,1,2,144.81,7.75,2.69,155.25,54.84,0,0.68,2.5,0,2.5,60.52,215.77,52855.65,2828.75,981.85,56666.25,20016.600000000002,0,248.20000000000002,912.5,0,912.5,22089.800000000003,78756.05,78756.05,365]
["Client D",null,505,"SA722-3905 GTH State","GTH Group Training Home","2025-01-01",null,"2025-12-31",null,365,1,4,291.70999999999998,0,5.42,297.13,57.97,0,1.36,2.5,0,2.5,64.33,361.46,106474.15,0,1978.3,108452.45,21159.05,0,496.40000000000003,912.5,0,912.5,23480.45,131932.9,131932.9,365]
["Client E",null,506,"SA722-3905 GTH State","GTH Group Training Home","2025-01-01",null,"2025-12-31",null,365,1,4,291.70999999999998,0,5.42,297.13,57.97,0,1.36,2.5,0,0,61.83,358.96,106474.15,0,1978.3,108452.45,21159.05,0,496.40000000000003,912.5,0,0,22567.95,131020.4,131020.4,365]
["Client 01",null,509,"SA716-3603 SL CORE","SL Supported Living","2025-01-01",null,"2025-12-31",null,365,1,2,144.81,0,2.69,147.5,34.020000000000003,0,0.68,2.5,2.25,2.5,41.95,189.45,52855.65,0,981.85,53837.5,12417.300000000001,0,248.20000000000002,912.5,821.25,912.5,15311.750000000002,69149.25,69149.25,365]
["Client 02",null,510,"SA716-3603 SL CORE","SL Supported Living","2025-01-01",null,"2025-12-31",null,365,1,3,223.56,9.2799999999999994,4.16,237,35.81,0,1.04,2.5,2.25,13.87,55.47,292.47000000000003,81599.399999999994,3387.2,1518.4,86505,13070.650000000001,0,379.6,912.5,821.25,5062.5499999999993,20246.55,106751.55,106751.55,365]
{"$rows_left_out":23}
{"sheet":"Exhibit","index":1,"n_rows":30,"n_cols":23,"rows_kept":30,"cut":false,"hidden":false,"merged":[[3,18,3,22],[3,0,3,6],[2,18,2,22],[2,15,2,16],[3,15,3,16],[2,10,2,11],[3,10,3,11],[2,0,2,5],[2,7,2,8],[3,7,3,8],[5,0,5,22],[8,9,8,10],[8,20,8,21],[8,12,8,18],[8,0,8,7],[6,18,6,19],[7,0,7,7],[7,9,7,10],[7,12,7,18],[7,20,7,21]]}
["Supported Living / Group Home -Exhibit C",null,null,null,null,null,null,null,null,null,null,null,null,null,null,null,null,null,null,null,"Revision #: 250101"]
[]
["ABC Residential Services",null,null,null,null,null,null,555777999,null,null,"1234-567890",null,null,"3S",null,"2025-03-01",null,null,14]
["Contractor Name",null,null,null,null,null,null,"Provider ID",null,null,"Contract No.",null,null,"Region",null,"Process Date",null,null,"No. of Clients (excluding SSP funded)"]
[]
["The undersigned hereby affirm that the following are the agreed upon number of clients and reimbursement rates associated with the indicated contract and contract period. This rate sheet revision supersedes all previous rate sheets as of the effective date."]
[]
[]
["Contractor Signature",null,null,null,null,null,null,null,null,"Date Signed",null,null,"DSHS Regional Administrator or Designee",null,null,null,null,null,null,null,"Date Signed"]
[]
{"$rows_left_out":21}
{"sheet":"2025 JUN","index":2,"n_rows":37,"n_cols":38,"rows_kept":37,"cut":false,"hidden":false,"merged":[[1,0,1,2],[1,3,1,4],[1,5,1,8],[1,11,1,23],[0,0,0,2],[0,3,0,4],[0,5,0,6],[0,7,0,10],[0,11,0,37]]}
["Program Name",null,null,"3S - ABC Residential Services",null,"Provider ID",null,{"$f":"VLOOKUP(D1,List!A2:C141,2)","v":555777999},null,null,null,"FOR PROVIDER USE ONLY\nDO NOT SUBMIT WITH COST REPORT"]
["Report Period",null,null,"2025-01-01",null,"2025-06-30",null,null,null,{"$f":"IF($AD$1=\"\",SUM(J4:J32),SUMIF($E$4:$E$32,$AD$1,J4:J32))","v":2642},{"$f":"IF($AD$1=\"\",SUM(K4:K32),SUMIF($E$4:$E$32,$AD$1,K4:K32))","v":18},"Annual Totals",null,null,null,null,null,null,null,null,null,null,null,null,{"$f":"IF($AD$1=\"\",SUM(Y4:Y32),SUMIF($E$4:$E$32,$AD$1,Y4:Y32))","v":573077.22},5894.27,10656.190000000002,589627.68000000005,115167.01000000001,0,2671.96,6605,4331.6399999999994,8104.3799999999992,136879.99,726507.67,726507.67,2642]
["Client Name (b) ","COCA Recipient","Client P1 ID (c)","P1 Service Code/RAC (v)","Program Type","Rate Effective Date (d)","Actual Start Date Overrides Column F","Rate End Date","Actual End Date Overrides Column H","Resid Days Paid","Client Count","ISS Tier Level (e)","ISS Daily Tier Rate (f)","ISS Prof Svs Daily Rate (k)","ISS CRST Tier Rate (l)","Total ISS Daily Rate","Admin Tier Rate (n)","Temp Rate Adjust (o)","Admin CRST Tier Rate (p)","Admin Cert Rate (q)","Transport Rate (r)","Other Non-ISS Rates (s)","Total Non-ISS Daily Rate","Total ISS & Non-ISS Daily Rate","Annual ISS Paid","Annual ISS Prof Svs Paid","Annual ISS CRST Paid","Total Annual ISS Paid","Annual Admin Paid","Annual Temp Rate Adjust","Annual Admin CRST Paid","Annual Admin Cert Paid","Annual Transport Paid","Annual Other Non-ISS Paid","Total Annual Non-ISS Paid","Annual ISS & Non-ISS Paid","Annual ISS & Non-ISS Paid per Client","Annual Days Paid per Client"]
["Client A",null,500,"SA722-3603 GH CORE","GH Group Home","2025-01-01",null,"2025-06-30",null,{"$f":"IF(F4>0,+IF(I4>0,I4,H4)-IF(G4>0,G4,F4)+1,0)","v":181},{"$f":"IF(C4<=0,\"\",IF(C4=C3,\"\",1))","v":1},4,291.70999999999998,0,5.42,{"$f":"SUM(M4:O4)","v":297.13},57.97,0,1.36,2.5,0,0,{"$f":"SUM(Q4:V4)","v":61.83},{"$f":"+P4+W4","v":358.96},{"$f":"M4*J4","v":52799.509999999995},{"$f":"J4*N4","v":0},{"$f":"O4*J4","v":981.02},{"$f":"$J4*P4","v":53780.53},10492.57,0,246.16000000000003,452.5,0,0,11191.23,{"$f":"AB4+AI4","v":64971.759999999995},{"$f":"IF(A5=A4,0,SUMIF($A$4:$A$4794,$A4,AB$4:AB$4794))+IF(A5=A4,0,SUMIF($A$4:$A$4794,$A4,AI$4:AI$4794))","v":64971.759999999995},{"$f":"IF(A5=A4,0,SUMIF($A$4:$A$4794,$A4,J$4:J$4794))+IF(A5=A4,0,SUMIF($A$4:$A$4794,$A4))","v":181}]
["Client B",null,502,"SA722-3603 GH CORE","GH Group Home","2025-01-01",null,"2025-06-30",null,181,1,3,223.56,0,4.16,{"$f":"SUM(M5:O5)","v":227.72},56.63,0,1.04,2.5,0,0,60.17,287.89,40464.36,{"$f":"J5*N5","v":0},752.96,41217.32,10250.030000000001,0,188.24,452.5,0,0,10890.77,52108.09,{"$f":"IF(A6=A5,0,SUMIF($A$4:$A$4794,$A5,AB$4:AB$4794))+IF(A6=A5,0,SUMIF($A$4:$A$4794,$A5,AI$4:AI$4794))","v":52108.09},{"$f":"IF(A6=A5,0,SUMIF($A$4:$A$4794,$A5,J$4:J$4794))+IF(A6=A5,0,SUMIF($A$4:$A$4794,$A5))","v":181}]
["Client C",null,503,"SA722-3603 GH CORE","GH Group Home","2025-01-01",null,"2025-06-30",null,181,1,2,144.81,7.75,2.69,155.25,54.84,0,0.68,2.5,0,2.5,60.52,215.77,26210.61,1402.75,486.89,28100.25,9926.0400000000009,0,123.08000000000001,452.5,0,452.5,10954.12,39054.370000000003,39054.370000000003,181]
["Client D",null,505,"SA722-3905 GTH State","GTH Group Training Home","2025-01-01",null,"2025-06-30",null,181,1,4,291.70999999999998,0,5.42,297.13,57.97,0,1.36,2.5,0,2.5,64.33,361.46,52799.509999999995,0,981.02,53780.53,10492.57,0,246.16000000000003,452.5,0,452.5,11643.73,65424.259999999995,65424.259999999995,181]
["Client E",null,506,"SA722-3905 GTH State","GTH Group Training Home","2025-01-01",null,"2025-06-30",null,181,1,4,291.70999999999998,0,5.42,297.13,57.97,0,1.36,2.5,0,0,61.83,358.96,52799.509999999995,0,981.02,53780.53,10492.57,0,246.16000000000003,452.5,0,0,11191.23,64971.759999999995,64971.759999999995,181]
["Client F",null,508,"SA722-3603 GTH CORE","GTH Group Training Home","2025-03-16",null,"2025-06-30",null,107,1,3,223.56,0,4.16,227.72,56.63,0,1.04,2.5,0,0,60.17,287.89,23920.920000000002,0,445.12,24366.04,6059.41,0,111.28,267.5,0,0,6438.1900000000005,30804.230000000003,30804.230000000003,107]
["Client 01",null,509,"SA716-3603 SL CORE","SL Supported Living","2025-01-01",null,"2025-06-30",null,181,1,2,144.81,0,2.69,147.5,34.020000000000003,0,0.68,2.5,2.25,2.5,41.95,189.45,26210.61,0,486.89,26697.5,6157.6200000000008,0,123.08000000000001,452.5,407.25,452.5,7592.9500000000007,34290.449999999997,34290.449999999997,181]
{"$rows_left_out":28}
{"sheet":"COCA","index":3,"n_rows":0,"n_cols":0,"rows_kept":0,"cut":false,"hidden":false,"merged":[]}

{"sheet":"YE Schedule H Rate History","index":4,"n_rows":49,"n_cols":38,"rows_kept":49,"cut":false,"hidden":false,"merged":[[1,0,1,2],[1,3,1,4],[1,5,1,8],[1,11,1,23],[0,0,0,2],[0,3,0,4],[0,5,0,6],[0,7,0,10],[0,11,0,37]]}
["Program Name",null,null,"3S - ABC Residential Services",null,"Provider ID",null,{"$f":"VLOOKUP(D1,List!A2:C141,2)","v":555777999},null,null,null,"FOR PROVIDER USE ONLY\nDO NOT SUBMIT WITH COST REPORT"]
["Report Period",null,null,"2025-01-01",null,"2025-12-31",null,null,null,{"$f":"IF($AD$1=\"\",SUM(J4:J44),SUMIF($E$4:$E$44,$AD$1,J4:J44))","v":5868},{"$f":"IF($AD$1=\"\",SUM(K4:K44),SUMIF($E$4:$E$44,$AD$1,K4:K44))","v":22},"Annual Totals",null,null,null,null,null,null,null,null,null,null,null,null,{"$f":"IF($AD$1=\"\",SUM(Y4:Y44),SUMIF($E$4:$E$44,$AD$1,Y4:Y44))","v":1290135.6100000001},11016.829999999998,24381.02,1325533.4599999997,254136.72999999998,0,6111.6900000000014,14612.5,11102.199999999999,21183.71,307146.83000000013,1632680.29,1632680.29,5868]
["Client Name (b) ","COCA Recipient","Client P1 ID (c)","P1 Service Code/RAC (v)","Program Type","Rate Effective Date (d)","Actual Start Date Overrides Column F","Rate End Date","Actual End Date Overrides Column H","Resid Days Paid","Client Count","ISS Tier Level (e)","ISS Daily Tier Rate (f)","ISS Prof Svs Daily Rate (k)","ISS CRST Tier Rate (l)","Total ISS Daily Rate","Admin Tier Rate (n)","Temp Rate Adjust (o)","Admin CRST Tier Rate (p)","Admin Cert Rate (q)","Transport Rate (r)","Other Non-ISS Rates (s)","Total Non-ISS Daily Rate","Total ISS & Non-ISS Daily Rate","Annual ISS Paid","Annual ISS Prof Svs Paid","Annual ISS CRST Paid","Total Annual ISS Paid","Annual Admin Paid","Annual Temp Rate Adjust","Annual Admin CRST Paid","Annual Admin Cert Paid","Annual Transport Paid","Annual Other Non-ISS Paid","Total Annual Non-ISS Paid","Annual ISS & Non-ISS Paid","Annual ISS & Non-ISS Paid per Client","Annual Days Paid per Client"]
["Client A",null,500,"SA722-3603 GH CORE","GH Group Home","2025-01-01",null,"2025-12-31","2025-11-25",{"$f":"IF(F4>0,+IF(I4>0,I4,H4)-IF(G4>0,G4,F4)+1,0)","v":329},{"$f":"IF(C4<=0,\"\",IF(C4=C3,\"\",1))","v":1},4,291.70999999999998,0,5.42,{"$f":"SUM(M4:O4)","v":297.13},57.97,0,1.36,2.5,0,0,{"$f":"SUM(Q4:V4)","v":61.83},{"$f":"+P4+W4","v":358.96},{"$f":"M4*J4","v":95972.59},{"$f":"J4*N4","v":0},{"$f":"O4*J4","v":1783.18},{"$f":"$J4*P4","v":97755.77},19072.13,0,447.44000000000005,822.5,0,0,20342.07,{"$f":"AB4+AI4","v":118097.84},{"$f":"IF(A5=A4,0,SUMIF($A$4:$A$4806,$A4,AB$4:AB$4806))+IF(A5=A4,0,SUMIF($A$4:$A$4806,$A4,AI$4:AI$4806))","v":118097.84},{"$f":"IF(A5=A4,0,SUMIF($A$4:$A$4806,$A4,J$4:J$4806))+IF(A5=A4,0,SUMIF($A$4:$A$4806,$A4))","v":329}]
["Client B",null,502,"SA722-3603 GH CORE","GH Group Home","2025-01-01",null,"2025-12-31",null,{"$f":"IF(F5>0,+IF(I5>0,I5,H5)-IF(G5>0,G5,F5)+1,0)","v":365},{"$f":"IF(C5<=0,\"\",IF(C5=C4,\"\",1))","v":1},3,223.56,0,4.16,227.72,56.63,0,1.04,2.5,0,0,{"$f":"SUM(Q5:V5)","v":60.17},{"$f":"+P5+W5","v":287.89},81599.399999999994,0,1518.4,{"$f":"$J5*P5","v":83117.8},{"$f":"$J5*Q5","v":20669.95},{"$f":"$J5*R5","v":0},{"$f":"$J5*S5","v":379.6},{"$f":"$J5*T5","v":912.5},{"$f":"$J5*U5","v":0},{"$f":"$J5*V5","v":0},{"$f":"$J5*W5","v":21962.05},{"$f":"AB5+AI5","v":105079.85},105079.85,365]
["Client C",null,503,"SA722-3603 GH CORE","GH Group Home","2025-01-01",null,"2025-06-30",null,181,1,2,144.81,7.75,2.69,155.25,54.84,0,0.68,2.5,0,2.5,60.52,215.77,26210.61,1402.75,486.89,28100.25,9926.0400000000009,0,123.08000000000001,452.5,0,452.5,10954.12,39054.370000000003,0,0]
["Client C",null,503,"SA722-3603 GH CORE","GH Group Home","2025-07-01",null,"2025-12-31",null,184,"",2,144.81,0,2.69,147.5,54.84,0,0.68,2.5,0,0,58.02,205.52,26645.040000000001,0,494.96,27140,10090.560000000001,0,125.12,460,0,0,10675.68,37815.68,76870.05,365]
["Client D",null,505,"SA722-3905 GTH State","GTH Group Training Home","2025-01-01",null,"2025-12-31",null,365,1,4,291.70999999999998,0,5.42,297.13,57.97,0,1.36,2.5,0,2.5,64.33,361.46,106474.15,0,1978.3,108452.45,21159.05,0,496.40000000000003,912.5,0,912.5,23480.45,131932.9,131932.9,365]
["Client E",null,506,"SA722-3905 GTH State","GTH Group Training Home","2025-01-01",null,"2025-12-31",null,365,1,4,291.70999999999998,0,5.42,297.13,57.97,0,1.36,2.5,0,0,61.83,358.96,106474.15,0,1978.3,108452.45,21159.05,0,496.40000000000003,912.5,0,0,22567.95,131020.4,131020.4,365]
["Client F",null,508,"SA722-3603 GTH CORE","GTH Group Training Home","2025-03-16",null,"2025-12-31",null,291,1,3,223.56,0,4.16,227.72,56.63,0,1.04,2.5,0,0,60.17,287.89,65055.96,0,1210.56,66266.52,16479.330000000002,0,302.64,727.5,0,0,17509.47,83775.990000000005,83775.990000000005,291]
{"$rows_left_out":40}
{"sheet":"2026 JAN","index":5,"n_rows":36,"n_cols":38,"rows_kept":36,"cut":false,"hidden":false,"merged":[[1,0,1,2],[1,3,1,4],[1,5,1,8],[1,11,1,23],[0,0,0,2],[0,3,0,4],[0,5,0,6],[0,7,0,10],[0,11,0,37]]}
["Program Name",null,null,"3S - ABC Residential Services",null,"Provider ID",null,{"$f":"VLOOKUP(D1,List!A2:C141,2)","v":555777999},null,null,null,"FOR PROVIDER USE ONLY\nDO NOT SUBMIT WITH COST REPORT"]
["Report Period",null,null,"2026-01-01",null,"2026-12-31",null,null,null,{"$f":"IF($AD$1=\"\",SUM(J4:J31),SUMIF($E$4:$E$31,$AD$1,J4:J31))","v":6570},{"$f":"IF($AD$1=\"\",SUM(K4:K31),SUMIF($E$4:$E$31,$AD$1,K4:K31))","v":18},"Annual Totals",null,null,null,null,null,null,null,null,null,null,null,null,{"$f":"IF($AD$1=\"\",SUM(Y4:Y31),SUMIF($E$4:$E$31,$AD$1,Y4:Y31))","v":1424569.4499999997},10161.599999999999,27882.350000000002,1462613.4000000001,276728.39999999997,0,6989.75,16425,15198.6,30973.899999999998,346315.65000000008,1808929.05,1808929.05,6570]
["Client Name (b) ","COCA Recipient","Client P1 ID (c)","P1 Service Code/RAC (v)","Program Type","Rate Effective Date (d)","Actual Start Date Overrides Column F","Rate End Date","Actual End Date Overrides Column H","Resid Days Paid","Client Count","ISS Tier Level (e)","ISS Daily Tier Rate (f)","ISS Prof Svs Daily Rate (k)","ISS CRST Tier Rate (l)","Total ISS Daily Rate","Admin Tier Rate (n)","Temp Rate Adjust (o)","Admin CRST Tier Rate (p)","Admin Cert Rate (q)","Transport Rate (r)","Other Non-ISS Rates (s)","Total Non-ISS Daily Rate","Total ISS & Non-ISS Daily Rate","Annual ISS Paid","Annual ISS Prof Svs Paid","Annual ISS CRST Paid","Total Annual ISS Paid","Annual Admin Paid","Annual Temp Rate Adjust","Annual Admin CRST Paid","Annual Admin Cert Paid","Annual Transport Paid","Annual Other Non-ISS Paid","Total Annual Non-ISS Paid","Annual ISS & Non-ISS Paid","Annual ISS & Non-ISS Paid per Client","Annual Days Paid per Client"]
["Client B",null,502,"SA722-3603 GH CORE","GH Group Home","2026-01-01",null,"2026-12-31",null,{"$f":"IF(F4>0,+IF(I4>0,I4,H4)-IF(G4>0,G4,F4)+1,0)","v":365},{"$f":"IF(C4<=0,\"\",IF(C4=C3,\"\",1))","v":1},3,223.56,0,4.16,{"$f":"SUM(M4:O4)","v":227.72},56.63,0,1.04,2.5,0,0,{"$f":"SUM(Q4:V4)","v":60.17},{"$f":"+P4+W4","v":287.89},{"$f":"M4*J4","v":81599.399999999994},{"$f":"J4*N4","v":0},{"$f":"O4*J4","v":1518.4},{"$f":"$J4*P4","v":83117.8},{"$f":"$J4*Q4","v":20669.95},{"$f":"$J4*R4","v":0},{"$f":"$J4*S4","v":379.6},{"$f":"$J4*T4","v":912.5},{"$f":"$J4*U4","v":0},{"$f":"$J4*V4","v":0},{"$f":"$J4*W4","v":21962.05},{"$f":"AB4+AI4","v":105079.85},{"$f":"IF(A5=A4,0,SUMIF($A$4:$A$4793,$A4,AB$4:AB$4793))+IF(A5=A4,0,SUMIF($A$4:$A$4793,$A4,AI$4:AI$4793))","v":105079.85},{"$f":"IF(A5=A4,0,SUMIF($A$4:$A$4793,$A4,J$4:J$4793))+IF(A5=A4,0,SUMIF($A$4:$A$4793,$A4))","v":365}]
["Client C",null,503,"SA722-3603 GH CORE","GH Group Home","2026-01-01",null,"2026-12-31",null,{"$f":"IF(F5>0,+IF(I5>0,I5,H5)-IF(G5>0,G5,F5)+1,0)","v":365},{"$f":"IF(C5<=0,\"\",IF(C5=C4,\"\",1))","v":1},2,144.81,0,2.69,147.5,54.84,0,0.68,2.5,0,0,58.02,205.52,52855.65,0,981.85,53837.5,20016.600000000002,0,248.20000000000002,912.5,0,0,21177.300000000003,75014.8,75014.8,365]
["Client D",null,505,"SA722-3905 GTH State","GTH Group Training Home","2026-01-01",null,"2026-12-31",null,365,1,4,291.70999999999998,0,5.42,297.13,57.97,0,1.36,2.5,0,2.5,64.33,361.46,106474.15,0,1978.3,108452.45,21159.05,0,496.40000000000003,912.5,0,912.5,23480.45,131932.9,131932.9,365]
["Client E",null,506,"SA722-3905 GTH State","GTH Group Training Home","2026-01-01",null,"2026-12-31",null,365,1,4,291.70999999999998,0,5.42,297.13,57.97,0,1.36,2.5,0,0,61.83,358.96,106474.15,0,1978.3,108452.45,21159.05,0,496.40000000000003,912.5,0,0,22567.95,131020.4,131020.4,365]
["Client F",null,508,"SA722-3603 GTH CORE","GTH Group Training Home","2026-01-01",null,"2026-12-31",null,365,1,3,223.56,0,4.16,227.72,56.63,0,1.04,2.5,0,0,60.17,287.89,81599.399999999994,0,1518.4,83117.8,20669.95,0,379.6,912.5,0,0,21962.05,105079.85,105079.85,365]
["Client 01",null,509,"SA716-3603 SL CORE","SL Supported Living","2026-01-01",null,"2026-12-31",null,365,1,2,144.81,0,2.69,147.5,34.020000000000003,0,0.68,2.5,2.25,2.5,41.95,189.45,52855.65,0,981.85,53837.5,12417.300000000001,0,248.20000000000002,912.5,821.25,912.5,15311.750000000002,69149.25,69149.25,365]
["Client 02",null,510,"SA716-3603 SL CORE","SL Supported Living","2026-01-01",null,"2026-12-31",null,365,1,3,223.56,9.2799999999999994,4.16,237,35.81,0,1.04,2.5,2.25,13.87,55.47,292.47000000000003,81599.399999999994,3387.2,1518.4,86505,13070.650000000001,0,379.6,912.5,821.25,5062.5499999999993,20246.55,106751.55,106751.55,365]
{"$rows_left_out":27}
{"sheet":"List","index":6,"n_rows":141,"n_cols":7,"rows_kept":141,"cut":false,"hidden":true,"merged":[]}
["Provider Name","Provider ID","Urban Designation",null,"Program Type",null,"Service Code & RAC"]
[]
["1N - Accendo of Washington",215573301,"MSA",null,"SL Supported Living",null,"SA716-3603 SL CORE"]
["1N - Adult Guidance & Empowerment Service",111684901,"MSA",null,"GH Group Home",null,"SA716-3604 SL CP"]
["1N - Alpha Supported Living (Spokane)",111320906,"MSA",null,"GTH Group Training Home",null,"SA716-3701 SL RCL"]
["1N - Ambitions - Spokane",111901906,"MSA",null,null,null,"SA716-3905 SL State"]
["1N - Ambitions - Wenatchee, Omak, Moses Lake",111901903,"MSA/NON-MSA",null,null,null,"SA722-3603 GH CORE"]
["1N - ARC of Spokane",111426502,"MSA",null,null,null,"SA722-3701 GH RCL"]
["1N - Assisted Residential Services",111705601,"MSA",null,null,null,"SA722-3905 GH State"]
["1N - Community Integrated Services",111425301,"MSA",null,null,null,"SA722-3603 GTH CORE"]
{"$rows_left_out":131}